agg,doi,genbank,ipg_id,name,pdb.0,pdb.1,seq,slug,states.0.brightness,states.0.em_max,states.0.ex_max,states.0.ext_coeff,states.0.lifetime,states.0.maturation,states.0.name,states.0.pka,states.0.qy,states.0.slug,switch_type,uniprot,uuid
wd,10.1016/0378-1119(95)00685-0,,,GFPmut2,,,MSKGEELFTGVVPILVELDGDVNGHKFSVSGEGEGDATYGKLTLKFICTTGKLPVPWPTLVTTFAYGLQCFARYPDHMKQHDFFKSAMPEGYVQERTIFFKDDGNYKTRAEVKFEGDTLVNRIELKGIDFKEDGNILGHKLEYNYNSHNVYIMADKQKNGIKVNFKIRHNIEDGSVQLADHYQQNTPIGDGPVLLPDNHYLSTQSALSKDPNEKRDHMVLLEFVTAAGITHGMDELYK,gfpmut2,39.35,508,485,53900,,5.6,default,,0.73,gfpmut2_default,b,,QS3XQ
m,10.1529/biophysj.104.055442,,,mCerulean,,,MVSKGEELFTGVVPILVELDGDVNGHKFSVSGEGEGDATYGKLTLKFICTTGKLPVPWPTLVTTLTWGVQCFARYPDHMKQHDFFKSAMPEGYVQERTIFFKDDGNYKTRAEVKFEGDTLVNRIELKGIDFKEDGNILGHKLEYNAISDNVYITADKQKNGIKANFKIRHNIEDGSVQLADHYQQNTPIGDGPVLLPDNHYLSTQSKLSKDPNEKRDHMVLLEFVTAAGITLGMDELYK,mcerulean,16.17,475,433,33000,,6.6,default,,0.49,mcerulean_default,b,,J2JWA
m,10.1038/nbt1037,AAV52164,3838123,mCherry,2H5Q,,MVSKGEEDNMAIIKEFMRFKVHMEGSVNGHEFEIEGEGEGRPYEGTQTAKLKVTKGGPLPFAWDILSPQFMYGSKAYVKHPADIPDYLKLSFPEGFKWERVMNFEDGGVVTVTQDSSLQDGEFIYKVKLRGTNFPSDGPVMQKKTMGWEASSERMYPEDGALKGEIKQRLKLKDGGHYDAEVKTTYKAKKPVQLPGAYNVNIKLDITSHNEDYTIVEQYERAEGRHSTGGMDELYK,mcherry,15.84,610,587,72000,1.4,15.0,default,4.5,0.22,mcherry_default,b,X5DSL3,ZERB6
m,10.1371/journal.pone.0171257,,,mCherry2,,,MVSKGEEDNMAIIKEFMRFKVHMEGSVNGHEFEIEGEGEGRPYEGTQTAKLKVTKGGPLPFAWDILSPQFMYGSKAYVKHPADIPDYLKLSFPEGFNWERVMNFEDGGVVTVTQDSSLQDGEFIYKVKLRGTNFPSDGPVMQCRTMGWEASTERMYPEDGALKGEIKQRLKLKDGGHYDAEVKTTYKAKKPVQLPGAYNVDIKLDILSHNEDYTIVEQYERAEGRHSTGGMDELYK,mcherry2,17.47,610,589,79400,,22.8,default,3.3,0.22,mcherry2_default,b,,CN92E
m,10.1371/journal.pbio.1001041,,,miniSOG,6GPU,,MEKSFVITDPRLPDNPIIFASDGFLELTEYSREEILGRNGRFLQGPETDQATVQKIRDAIRDQREITVQLINYTKSGKKFWNLLHLQPMRDQKGELQYFIGVQLDG,minisog,6.06,501,447,14100,,,default,,0.43,minisog_default,b,,ZZHSE
m,10.1038/s41467-018-08050-8,MK176509,,miRFP670nano,6MGH,,MANLDKMLNTTVTEVRQFLQVDRVCVFQFEEDYSGVVVVEAVDDRWISILKTQVRDRYFMETRGEEYSHGRYQAIADIYTANLTECYRDLLTQFQVRAILAVPILQGKKLWGLLVAHQLAAPRQWQTWEIDFLKQQAVVVGIAIQQS,mirfp670nano,10.26,670,645,95000,,100.0,default,3.7,0.108,mirfp670nano_default,b,,1KNNM
m,10.1073/pnas.1807449115,MK040732,,mKelly2,,,MELIKENMRMKLYMEGTVGNHHFKCTAEGEGKPYEGTQTQRIKVVEGGPLPFAFDILATCFMYGSKTFINYPQGIPDFFKQSFPEGFTWERVTTYEDGGVLTVTQDTSLQDGYLIYNVKLRGVNFPSNGPVMQKKTLGWEPTTEYLVPVDGGLEGTCDMALRLVGGGHLKCNLKTTYRSKKPAKNLKMPGEHQVDRKLERIKEADNETYVEQHEVAVAR,mkelly2,7.74,649,598,43000,,20.0,default,5.6,0.18,mkelly2_default,b,,T9G4X
m,10.1038/nmeth.2413,AGG56535,34051755,mNeonGreen,5LTP,5LTR,MVSKGEEDNMASLPATHELHIFGSINGVDFDMVGQGTGNPNDGYEELNLKSTKGDLQFSPWILVPHIGYGFHQYLPYPDGMSPFQAAMVDGSGYQVHRTMQFEDGASLTVNYRYTYEGSHIKGEAQVKGTGFPADGPVMTNSLTAADWCRSKKTYPNDKTIISTFKWSYTTGNGKRYRSTARTTYTFAKPMAANYLKNQPMYVFRKTELKHSKTELNFKEWQKAFTDVMGMDELYK,mneongreen,92.8,517,506,116000,3.1,10.0,default,5.7,0.8,mneongreen_default,b,,ZRKRV
m,10.1038/nmeth.2888,AHL19969,49083569,mNeptune2.5,,,MVSKGEELIKENMHTKLYMEGTVNNHHFKCTHEGEGKPYEGTQTNRIKVVEGGPLPFAFDILATCFMYGSKTFINHTQGIPDFFKQSFPEGFTWERVTTYEDGGVLTVTQDTSLQDGCLIYNVKLRGVNFPSNGPVMQKKTLGWEASTETLYPADGGLEGRCDMALKLVGGGHLHCNLKTTYRSKKPAKNLKMPGVYFVDRRLERIKEADNETYVEQHEVAVARYCDLPSKLGHKLNGMDELYK,mneptune25,22.8,643,599,95000,,26.0,default,5.8,0.24,mneptune25_default,b,,OADBJ
m,10.1038/srep20889,ATE88097,,mRuby3,,,MVSKGEELIKENMRMKVVMEGSVNGHQFKCTGEGEGRPYEGVQTMRIKVIEGGPLPFAFDILATSFMYGSRTFIKYPADIPDFFKQSFPEGFTWERVTRYEDGGVVTVTQDTSLEDGELVYNVKVRGVNFPSNGPVMQKKTKGWEPNTEMMYPADGGLRGYTDIALKVDGGGHLHCNFVTTYRSKKTVGNIKMPGVHAVDHRLERIEESDNETYVVQREVAVAKYSNLGGGMDELYK,mruby3,57.6,592,558,128000,,136.5,default,4.8,0.45,mruby3_default,b,,MZMFB
m,10.1038/nmeth.4074,APD76536,129830965,mScarlet-I,,,MVSKGEAVIKEFMRFKVHMEGSMNGHEFEIEGEGEGRPYEGTQTAKLKVTKGGPLPFSWDILSPQFMYGSRAFIKHPADIPDYYKQSFPEGFKWERVMNFEDGGAVTVTQDTSLEDGTLIYKVKLRGTNFPPDGPVMQKKTMGWEASTERLYPEDGVLKGDIKMALRLKDGGRYLADFKTTYKAKKPVQMPGAYNVDRKLDITSHNEDYTVVEQYERSEGRHSTGGMDELYK,mscarlet-i,56.16,593,569,104000,3.1,36.0,default,5.4,0.54,mscarlet-i_default,b,,6VVTK
wd,10.1038/nbt1172,ASL68970,154375264,Superfolder GFP,2B3P,2Q6P,MSKGEELFTGVVPILVELDGDVNGHKFSVRGEGEGDATNGKLTLKFICTTGKLPVPWPTLVTTLTYGVQCFSRYPDHMKRHDFFKSAMPEGYVQERTISFKDDGTYKTRAEVKFEGDTLVNRIELKGIDFKEDGNILGHKLEYNFNSHNVYITADKQKNGIKANFKIRHNVEDGSVQLADHYQQNTPIGDGPVLLPDNHYLSTQSVLSKDPNEKRDHMVLLEFVTAAGITHGMDELYK,superfolder-gfp,54.15,510,488,83300,3.1,13.6,default,,0.65,superfolder-gfp_default,b,,B4SOW
m,10.1111/mmi.14206,,,Superfolder mTurquoise2 ox,,,MVSKGEELFTGVVPILVELDGDVNGHKFSVRGEGEGDATNGKLTLKFICTTGKLPVPWPTLVTTLSWGVQVFARYPDHMKQHDFFKSAMPEGYVQERTISFKDDGTYKTRAEVKFEGDTLVNRIELKGIDFKEDGNILGHKLEYNYFSDNVYITADKQKNGIKANFKIRHNVEDGGVQLADHYQQNTPIGDGPVLLPDNHYLSTQSKLSKDPNEKRDHMVLLEFVTAAGITLGMDELYK,superfolder-mturquoise2-ox,,474,434,,,,default,,,superfolder-mturquoise2-ox_default,b,,QEXW4
wd,10.1038/nbt1066,,,YPet,,,MVSKGEELFTGVVPILVELDGDVNGHKFSVSGEGEGDATYGKLTLKLLCTTGKLPVPWPTLVTTLGYGVQCFARYPDHMKQHDFFKSAMPEGYVQERTIFFKDDGNYKTRAEVKFEGDTLVNRIELKGIDFKEDGNILGHKLEYNYNSHNVYITADKQKNGIKANFKIRHNIEDGGVQLADHYQQNTPIGDGPVLLPDNHYLSYQSALFKDPNEKRDHMVLLEFLTAAGITEGMNELYK,ypet,80.08,530,517,104000,,,default,5.63,0.77,ypet_default,b,,AQACH
