agg,doi,genbank,ipg_id,name,pdb.0,seq,slug,states.0.brightness,states.0.em_max,states.0.ex_max,states.0.ext_coeff,states.0.lifetime,states.0.maturation,states.0.name,states.0.pka,states.0.qy,states.0.slug,switch_type,uniprot,uuid
d,10.1038/nbt0396-315,,,&alpha;GFP,,MSKGEELFTGVVPILVELDGDVNGHKFSVSGEGEGDATYGKLTLKFICTTGKLPVPWPTLVTTFSYGVQCFSRYPDHMKRHDFFKSAMPEGYVQERTISFKDDGNYKTRAEVKFEGDTLVNRIELKGIDFKEDGNILGHKLEYNYNSHNVYITADKQKNGIKANFKIRHNIEDGSVQLADHYQQNTPIGDGPVLLPDNHYLSTQSALSKDPNEKRDHMVLLEFVTAAGITHGMDELYK,alphagfp,23.7,506,397,30000,,,default,,0.79,alphagfp_default,b,,B28N7
,10.1186/1472-6750-3-5,,,cpT-Sapphire 174-173,,,cpt-sapphire-174-173,23.32,511,399,44000,,,default,5.2,0.53,cpt-sapphire-174-173_default,b,,AJWMF
m,10.1021/bi700199g,,,EBFP1.5,,MVSKGEELFTGVVPILVELDGDVNGHKFSVRGEGEGDATNGKLTLKFICTTGKLPVPWPTLVTTLSHGVQCFARYPDHMKQHDFFKSAMPEGYVQERTIFFKDDGTYKTRAEVKFEGDTLVNRIELKGIDFKEDGNILGHKLEYNHNSNNVYIAADKQKNGIKVNFKIRHNVEDGSVQLADHYQQNTPIGDGPVLLPDSHYLSTQSVLSKDPNEKRDHMVLLEFVTAAGITLGMDELYK,ebfp15,22.79,449,381,43000,,,default,4.8,0.53,ebfp15_default,b,,XBGJO
m,10.1021/bi700199g,,,mBlueberry2,,MVSKGEENNVAIIKEFMRFKVHMEGSVNGHEFEIEGEGEGRPYEGTQTAKLKVTKGGPLPFAWDILSPQFLFGSKVYIKHPADIPDYFKLSFPEGFKWERVMNFEDGGVVTVTQDSSLQDGVFIYKVKLRGTNFPSDGPVMQKKTMGWEAFSERMYPEDGALKSEIKTRLKLKDGGHYDAEVKTTYKAKKPVQLPGAYNVNIKLDIVSHNEDYTIVEQYERAEGRHSTGGMDELYK,mblueberry2,24.48,467,402,51000,,,default,2.5,0.48,mblueberry2_default,b,,NYYN4
t,10.1371/journal.pone.0002680,ABB17965,4901536,mmilCFP,,MALPKQMKLTYHMEGTVNGHFFIIKGEGGGEPYEGTHTIKLQVVEGSPLPFSPDILSTVFQYGNRCFTKYPPNIVDYFKNSCSGGGYTFGRSFLYEDGAVCTASGDITLSSDKSSFEHKSKFLGVNFPADGPVMKKETTNWEPSCEKMTPNGMTLIGDVTEFLLKKDGKRYKCQFHTFHDAKEKSRNMPMPDFHFVQHEIERKDLPGPMQTWQLTEHAAACKNCFTE,mmilcfp,38.25,492,404,42500,,,default,,0.9,mmilcfp_default,b,A8CLU7,QB1DP
m,10.1371/journal.pone.0028674,,,mTagBFP2,,MVSKGEELIKENMHMKLYMEGTVDNHHFKCTSEGEGKPYEGTQTMRIKVVEGGPLPFAFDILATSFLYGSKTFINHTQGIPDFFKQSFPEGFTWERVTTYEDGGVLTATQDTSLQDGCLIYNVKIRGVNFTSNGPVMQKKTLGWEAFTETLYPADGGLEGRNDMALKLVGGSHLIANAKTTYRSKKPAKNLKMPGVYYVDYRLERIKEANNETYVEQHEVAVARYCDLPSKLGHKLN,mtagbfp2,32.38,454,399,50600,2.6,12.0,default,2.7,0.64,mtagbfp2_default,b,,ZO7NN
m,10.1038/nmeth.1207,,,mT-Sapphire,,MVSKGEELFTGVVPILVELDGDVNGHKFSVSGEGEGDATYGKLTLKFICTTGKLPVPWPTLVTTFSYGVMVFARYPDHMKQHDFFKSAMPEGYVQERTIFFKDDGNYKTRAEVKFEGDTLVNRIELKGIDFKEDGNILGHKLEYNFNSHNVYIMADKQKNGIKANFKIRHNIEDGGVQLADHYQQNTPIGDGPVLLPDNHYLSIQSKLSKDPNEKRDHMVLLEFVTAAGITLGMDELYK,mt-sapphire,26.4,511,399,44000,,156.5,default,4.9,0.6,mt-sapphire_default,b,,KSK4V
t,10.1371/journal.pone.0002680,ACD13191,14926072,psamCFP,,MASTKNVLPNMMTLTYHMEGSVNGHNFEIIGEGTGNPKEGKHTITLQVVKGGPLPFSVDILSTVFQYGNRCFTKYPPNTVDYFKNSCPPGYTFERSFLYEDGAVCTASGDITLSDDKASFHHKSKFFGVNFPDDGPVMKKKTTDWEPSCEKMTPSGKTLKGDVIEFLLLEGGGRYKCQFHTVYRAKTEPKRMPEFHFVQHKLTRTDVSDPLKQQWQLTEDAAACESCFHK,psamcfp,29.57,492,404,30800,,,default,,0.96,psamcfp_default,b,B6CTZ2,U69HK
m,10.1016/j.chembiol.2008.08.006,,,TagBFP,3M24,MSELIKENMHMKLYMEGTVDNHHFKCTSEGEGKPYEGTQTMRIKVVEGGPLPFAFDILATSFLYGSKTFINHTQGIPDFFKQSFPEGFTWERVTTYEDGGVLTATQDTSLQDGCLIYNVKIRGVNFTSNGPVMQKKTLGWEAFTETLYPADGGLEGRNDMALKLVGGSHLIANIKTTYRSKKPAKNLKMPGVYYVDYRLERIKEANNETYVEQHEVAVARYCDLPSKLGHKLN,tagbfp,32.76,457,402,52000,2.6,13.0,default,2.7,0.63,tagbfp_default,b,,BFJKS
wd,10.1186/1472-6750-3-5,,,T-Sapphire,,MVSKGEELFTGVVPILVELDGDVNGHKFSVSGEGEGDATYGKLTLKFICTTGKLPVPWPTLVTTFSYGVMVFARYPDHMKQHDFFKSAMPEGYVQERTIFFKDDGNYKTRAEVKFEGDTLVNRIELKGIDFKEDGNILGHKLEYNFNSHNVYIMADKQKNGIKANFKIRHNIEDGGVQLADHYQQNTPIGDGPVLLPDNHYLSIQSALSKDPNEKRDHMVLLEFVTAAGITLGMDELYK,t-sapphire,26.4,511,399,44000,2.93,156.5,default,4.9,0.6,t-sapphire_default,b,,NLY5P
