agg,doi,genbank,ipg_id,name,pdb.0,pdb.1,pdb.2,seq,slug,states.0.brightness,states.0.em_max,states.0.ex_max,states.0.ext_coeff,states.0.lifetime,states.0.maturation,states.0.name,states.0.pka,states.0.qy,states.0.slug,switch_type,uniprot,uuid
wd,10.1074/jbc.m102815200,,,Citrine,1HUY,3DPW,,MVSKGEELFTGVVPILVELDGDVNGHKFSVSGEGEGDATYGKLTLKFICTTGKLPVPWPTLVTTFGYGLMCFARYPDHMKQHDFFKSAMPEGYVQERTIFFKDDGNYKTRAEVKFEGDTLVNRIELKGIDFKEDGNILGHKLEYNYNSHNVYIMADKQKNGIKVNFKIRHNIEDGSVQLADHYQQNTPIGDGPVLLPDNHYLSYQSALSKDPNEKRDHMVLLEFVTAAGITLGMDELYK,citrine,58.52,529,516,77000,3.6,,default,5.7,0.76,citrine_default,b,,VR7EN
t,10.1038/13657,AAF03369,836144,DsRed,1GGX,1ZGO,1G7K,MRSSKNVIKEFMRFKVRMEGTVNGHEFEIEGEGEGRPYEGHNTVKLKVTKGGPLPFAWDILSPQFQYGSKVYVKHPADIPDYKKLSFPEGFKWERVMNFEDGGVVTVTQDSSLQDGCFIYKVKFIGVNFPSDGPVMQKKTMGWEASTERLYPRDGVLKGEIHKALKLKDGGHYLVEFKSIYMAKKPVQLPGYYYVDSKLDITSHNEDYTIVEQYERTEGRHHLFL,dsred,49.3,583,558,72500,,1600.0,default,,0.68,dsred_default,b,Q9U6Y8,EGE3L
m,10.1038/ncomms2208,,,FusionRed,,,,MVSELIKENMPMKLYMEGTVNNHHFKCTSEGEGKPYEGTQTMRIKVVEGGPLPFAFDILATSFMYGSRTFIKHPPGIPDFFKQSFPEGFTWERVTTYEDGGVLTATQDTSLQDGCLIYNVKVRGVNFPANGPVMQKKTLGWEASTETMYPADGGLEGACDMALKLVGGGHLICNLETTYRSKKPATNLKMPGVYNVDHRLERIKEADDETYVEQHEVAVARYSTGGAGDGGK,fusionred,17.95,608,580,94500,1.8,130.0,default,4.6,0.19,fusionred_default,b,,S6A7A
m,10.1073/pnas.0914365107,,,LSS-mKate2,3NT3,,,MSELIKENMHMKLYMEGTVNNHHFKCTSEGEGKPYEGTQTMRIKVVEGGPLPFAFDILATSFMYGSYTFINHTQGIPDFFKQSFPEGFTWERVTTYEDGGVLTATQDTSLQDGCLIYNVKIRGVNFTSNGPVMQKKTLGWEAGTEMLYPADGGLEGRSDDALKLVGGGHLICNLKSTYRSKKPAKNLKVPGVYYVDRRLERIKEADKETYVEQHEVAVARYCDLPSKLGHKLN,lss-mkate2,4.42,605,460,26000,1.4,150.0,default,2.7,0.17,lss-mkate2_default,b,,RU9EF
m,10.1021/ja3018972,,,LSSmOrange,4Q7R,,,MVSKGEENNMAIIKEFMRFKVRMEGSVNGHEFEIEGEGEGRPYEGFQTVKLKVTKGGPLPFAWDILSPQFTYGSKAYVKHPADIPDYLKLSFPEGFKWERVMNFEDGGVVTVTQDSSLQDGEFIYKVKLRGTNFPSDGPVMQKKTMGMEASSERMYPEDGALKGEDKLRLKLKDGGHYTSEVKTTYKAKKPVQLPGAYIVDIKLDITSHNEDYTIVEQYERAEGRHSTGGMDELYK,lssmorange,23.4,572,437,52000,,138.0,default,5.7,0.45,lssmorange_default,b,,OVJRJ
m,10.1038/nmeth.1207,ABW74903,13918900,mAmetrine,,,,MVSKGEELFTGVVPILVELDGDVNGHKFSVRGEGEGDATNGKLTLKFICTSGKLPVPWPTLVTTLSYGVQCFARYPDHMKQHDFFKSAMPEGYVQERTISFKDDGSYRTRAEVKFEGDTLVNRIELKGIDFKEDGNILGHKLEYNMNVWDAYITADKQKNGIKANFKIEHNVEDGGVQLADAYQQNTPIGDGSVLLPDNHYLSFQSKLFKDPNEQRDHMVLLEFVTAAGITPGMDELYK,mametrine,26.1,526,406,45000,,1.8,default,6.0,0.58,mametrine_default,b,,DF1S4
m,10.1038/nmeth.2888,AHL19967,49083567,mCardinal,4OQW,,,MVSKGEELIKENMHMKLYMEGTVNNHHFKCTTEGEGKPYEGTQTQRIKVVEGGPLPFAFDILATCFMYGSKTFINHTQGIPDFFKQSFPEGFTWERVTTYEDGGVLTVTQDTSLQDGCLIYNVKLRGVNFPSNGPVMQKKTLGWEATTETLYPADGGLEGRCDMALKLVGGGHLHCNLKTTYRSKKPAKNLKMPGVYFVDRRLERIKEADNETYVEQHEVAVARYCDLPSKLGHKLNGMDELYK,mcardinal,16.53,659,604,87000,,27.0,default,5.3,0.19,mcardinal_default,b,,7EWEM
m,10.1038/nmeth.2413,AGG56535,34051755,mNeonGreen,5LTP,5LTR,,MVSKGEEDNMASLPATHELHIFGSINGVDFDMVGQGTGNPNDGYEELNLKSTKGDLQFSPWILVPHIGYGFHQYLPYPDGMSPFQAAMVDGSGYQVHRTMQFEDGASLTVNYRYTYEGSHIKGEAQVKGTGFPADGPVMTNSLTAADWCRSKKTYPNDKTIISTFKWSYTTGNGKRYRSTARTTYTFAKPMAANYLKNQPMYVFRKTELKHSKTELNFKEWQKAFTDVMGMDELYK,mneongreen,92.8,517,506,116000,3.1,10.0,default,5.7,0.8,mneongreen_default,b,,ZRKRV
m,10.1038/srep20889,ATE88097,,mRuby3,,,,MVSKGEELIKENMRMKVVMEGSVNGHQFKCTGEGEGRPYEGVQTMRIKVIEGGPLPFAFDILATSFMYGSRTFIKYPADIPDFFKQSFPEGFTWERVTRYEDGGVVTVTQDTSLEDGELVYNVKVRGVNFPSNGPVMQKKTKGWEPNTEMMYPADGGLRGYTDIALKVDGGGHLHCNFVTTYRSKKTVGNIKMPGVHAVDHRLERIEESDNETYVVQREVAVAKYSNLGGGMDELYK,mruby3,57.6,592,558,128000,,136.5,default,4.8,0.45,mruby3_default,b,,MZMFB
m,10.1038/nmeth.4074,APD76535,129830964,mScarlet,5LK4,,,MVSKGEAVIKEFMRFKVHMEGSMNGHEFEIEGEGEGRPYEGTQTAKLKVTKGGPLPFSWDILSPQFMYGSRAFTKHPADIPDYYKQSFPEGFKWERVMNFEDGGAVTVTQDTSLEDGTLIYKVKLRGTNFPPDGPVMQKKTMGWEASTERLYPEDGVLKGDIKMALRLKDGGRYLADFKTTYKAKKPVQMPGAYNVDRKLDITSHNEDYTVVEQYERSEGRHSTGGMDELYK,mscarlet,70.0,594,569,100000,3.9,174.0,default,5.3,0.7,mscarlet_default,b,,FVS3D
m,10.1038/nmeth.4074,APD76537,129830966,mScarlet-H,,,,MVSKGEAVIKEFMRFKVHMEGSMNGHEFEIEGEGEGRPYEGTQTAKLKVTKGGPLPFSWDILSPQFMYGSRAFTKHPADIPDYYKQSFPEGFKWERVMNFEDGGAVTVTQDTSLEDGTLIYKVKLRGTNFPPDGPVMQKKTMGWEASTERLYPEDGVLKGDIKHALRLKDGGRYLADFKTTYKAKKPVQMPGAYNVDRKLDITSHNEDYTVVEQYERSEGRHSTGGMDELYK,mscarlet-h,14.8,592,551,74000,1.3,264.0,default,4.8,0.2,mscarlet-h_default,b,,588N2
m,10.1038/nmeth.4074,APD76536,129830965,mScarlet-I,,,,MVSKGEAVIKEFMRFKVHMEGSMNGHEFEIEGEGEGRPYEGTQTAKLKVTKGGPLPFSWDILSPQFMYGSRAFIKHPADIPDYYKQSFPEGFKWERVMNFEDGGAVTVTQDTSLEDGTLIYKVKLRGTNFPPDGPVMQKKTMGWEASTERLYPEDGVLKGDIKMALRLKDGGRYLADFKTTYKAKKPVQMPGAYNVDRKLDITSHNEDYTVVEQYERSEGRHSTGGMDELYK,mscarlet-i,56.16,593,569,104000,3.1,36.0,default,5.4,0.54,mscarlet-i_default,b,,6VVTK
wd,10.1186/1472-6750-3-5,,,T-Sapphire,,,,MVSKGEELFTGVVPILVELDGDVNGHKFSVSGEGEGDATYGKLTLKFICTTGKLPVPWPTLVTTFSYGVMVFARYPDHMKQHDFFKSAMPEGYVQERTIFFKDDGNYKTRAEVKFEGDTLVNRIELKGIDFKEDGNILGHKLEYNFNSHNVYIMADKQKNGIKANFKIRHNIEDGGVQLADHYQQNTPIGDGPVLLPDNHYLSIQSALSKDPNEKRDHMVLLEFVTAAGITLGMDELYK,t-sapphire,26.4,511,399,44000,2.93,156.5,default,4.9,0.6,t-sapphire_default,b,,NLY5P
