agg,doi,genbank,ipg_id,name,pdb,pdb.0,pdb.1,seq,slug,states.0.brightness,states.0.em_max,states.0.ex_max,states.0.ext_coeff,states.0.lifetime,states.0.maturation,states.0.name,states.0.pka,states.0.qy,states.0.slug,states.1.brightness,states.1.em_max,states.1.ex_max,states.1.ext_coeff,states.1.lifetime,states.1.maturation,states.1.name,states.1.pka,states.1.qy,states.1.slug,switch_type,transitions.0.from_state,transitions.0.to_state,transitions.0.trans_wave,uniprot,uuid
,10.1098/rsob.130206,AEP19814,24814318,CheGFP1,,,,MASAGALLLNQRVPFIMELDAEVNGIRFAVRGKGTGDATTGIIDTKFVCTTGKLPVPWASISSTMAYGALCFAKYPDSVKDFFKSAMPDGYIQEKTISFENDGAYKVRGVITYEHGSIYNRVTLKGEGFKKDGLILQKQYEFCCPNSAVYVLPDKENNGLRVVYNTIYKLKDGGHHLAAHEQQNTPLGGGVVDIPNYHHIHAGSIFSKDLEETRDHMCLVETVRAVNLETYN,chegfp1,,500,488,,,,default,,,chegfp1_default,,,,,,,,,,,b,,,,J9PGT0,63KQB
wd,10.1074/jbc.m102815200,,,Citrine,,1HUY,3DPW,MVSKGEELFTGVVPILVELDGDVNGHKFSVSGEGEGDATYGKLTLKFICTTGKLPVPWPTLVTTFGYGLMCFARYPDHMKQHDFFKSAMPEGYVQERTIFFKDDGNYKTRAEVKFEGDTLVNRIELKGIDFKEDGNILGHKLEYNYNSHNVYIMADKQKNGIKVNFKIRHNIEDGSVQLADHYQQNTPIGDGPVLLPDNHYLSYQSALSKDPNEKRDHMVLLEFVTAAGITLGMDELYK,citrine,58.52,529,516,77000,3.6,,default,5.7,0.76,citrine_default,,,,,,,,,,,b,,,,,VR7EN
d,10.1039/c8ib00063h,,,Citrine2,,,,MVSKGEELFTGVVPILVELDGDVNGHKFSVTGEGEGDATYGKLTLKFICTTGKLPVPWPTLVTTFGYGLTCFARYPDHMKQHDFFKSAMPEGYVQERTIFFKDDGNYKTRAEVKFEGDTLVNRIELKGIDFKEDGNILGHKLEYNHNSHYVYIMADKQKNGIKANFKIRHNIEDGSVQLADHYQQNTPIGDGPVLLPDNHYLSYQSQLSKDPNEERDHTVLLEFVTAAGITLGMGELYK,citrine2,68.6,522,509,98000,3.3,,default,5.9,0.7,citrine2_default,,,,,,,,,,,b,,,,,ZWH88
,10.1074/jbc.m102815200,,,cpCitrine,,,,DPMVSKGEELFTGVVPILVELDGDVNGHKFSVSGEGEGDATYGKLTLKFILTTGKLPVPWPTLVTTFGYGLMVFARYPDHMKRHDFFKSAMPEGYVQERTIFFKDDGNYKTRAEVKFEGDTLVNRIELKGIDFKEDGNILGHKLEYNYNSHNVYIMADKQKNGIKVNFKIRHNIEDGSVQLADHYQQNTPIGDGPVLLPDNHYLSYQSALSKDPNEKRDHMVLLEFVTAAGITHGMDELYK,cpcitrine,2.0,524,506,20000,,,default,,0.1,cpcitrine_default,,,,,,,,,,,b,,,,,9PBZV
d,10.1016/j.jmb.2010.06.056,,,dClavGR1.6,,,,MVSKGEETIMSVIKPDMKIKLRMEGNVNGHAFVIEGEGSGKPFEGIQTIDLEVKEGAPLPFAYDILTTAFHYGNRVFTKYPEDIPDYFKQSFPEGYSWERSMTYEDGGICIATNDITMEEDSFINKIHFKGVNFPPNGPVMQKRTVGWEASTEKMYVRDGVLKGDVKMKLLLKGGGHYRCDFRTTYKVKQKAVKLPDYHFVDHRIEILSHDKDYNKVKLYEHAVAHSGLPGMDELYK,dclavgr16,,,,,,,,,,,,,,,,,,,,,,,,,,9YVT9
d,10.1073/pnas.082243699,,,dimer1,,,,MVASSEDVIKEFMRFKVRMEGSVNGHEFEIEGEGEGRPYEGTQTAKLKVTKGGPLPFAWDILSPQFQYGSKVYVKHPADIPDYKKLSFPEGFKWERVMNFEDGGVVTVTQDSSLQDGCFIYKVKFRGVNFPSDGPVMQKKTMGWEASTERLYPRDGVLKGEIHQALKLKDGGHYLVEFKTIYMAKKPVQLPGYYYVDTKLDITSHNEDYTIVEQYERAEGRHHLFL,dimer1,,579,551,,,,default,,,dimer1_default,,,,,,,,,,,b,,,,,ZC4KN
d,10.1073/pnas.082243699,AAM54542,142581,dimer2,,,,MVASSEDVIKEFMRFKVRMEGSVNGHEFEIEGEGEGRPYEGTQTAKLKVTKGGPLPFAWDILSPQFQYGSKAYVKHPADIPDYKKLSFPEGFKWERVMNFEDGGVVTVTQDSSLQDGTLIYKVKFRGTNFPPDGPVMQKKTMGWEASTERLYPRDGVLKGEIHQALKLKDGGHYLVEFKTIYMAKKPVQLPGYYYVDTKLDITSHNEDYTIVEQYERSEGRHHLFL,dimer2,47.61,579,552,69000,,120.0,default,4.9,0.69,dimer2_default,,,,,,,,,,,b,,,,,DFXUK
d,10.1016/j.chembiol.2013.08.008,,,dPapaya0.1,,,,MVSKGEEHSKHGLKEEMTMKYHMEGCVNGHKFVITGEGIGYPFKGKQTINLCVIEGGPLPFSEDILSAGFKYGDRIFTEYPQDIVDYFKNSCPAGYTWGRSFLFEDGAVCRCNVDITVSEKENCIYHKSIFNGVNFPADGPVMKKMTTNWEASCEKIMPVPKQGILKGDVSMYLLLKDGGRYRCQFDTVYKAKSVPSKMPEWHFIQHKLLREDRSDAKNQKWQLTEHAIAFPSALAGMDELYK,dpapaya01,,,,,,,,,,,,,,,,,,,,,,,,,,ZRNCZ
d,10.1042/bj20060874,,,dTFP0.1,,,,MVSKGEETTMGVIKPDMKIKLKMEGNVNGHAFVIEGEGEGKPYDGTNTVNLEVKEGAPLPFSYDILSNAFQYGNRAFTKYPDDIADYFKQSFPEGYSWERTMTFEDKGIVKVKSDISMEEDSFIYEIRLKGKNFPPNGPVMQKKTLKWEPSTEILYVRDGVLVGDISHSLLLEGGGHYRCDFKTIYKAKKVVKLPDYHFVDHRIEILNHDKDYNKVTLYENAVARYSLLPSQAGMDELYK,dtfp01,26.46,485,456,42000,,,default,,0.63,dtfp01_default,,,,,,,,,,,b,,,,,2BJM7
d,10.1042/bj20060874,ABG77396,5860095,dTFP0.2,,,,MVSKGEETTMGVIKPDMKIKLKMEGNVNGHAFVIEGEGEGKPYDGTNTVNLEVKEGAPLPFSYDILSNAFQYGNRAFTKYPDDIANYFKQSFPEGYSWERTMTFEDKGIVKVKSDISMEEDSFIYEIRLKGKNFPPNGPVMQKKTLKWEPSTEILYVRDGVLVGDISHSLLLEGGGHYRCDFKTIYKAKKVVKLPDYHFVDHRIEILNHDKDYNKVTLYENAVARYSLLPPQAGMDELYK,dtfp02,40.8,486,456,60000,,,default,,0.68,dtfp02_default,,,,,,,,,,,b,,,,,QQJHZ
d,10.1038/nbt1037,AAV52168,3838230,dTomato,,,,MVSKGEEVIKEFMRFKVRMEGSMNGHEFEIEGEGEGRPYEGTQTAKLKVTKGGPLPFAWDILSPQFMYGSKAYVKHPADIPDYKKLSFPEGFKWERVMNFEDGGLVTVTQDSSLQDGTLIYKVKMRGTNFPPDGPVMQKKTMGWEASTERLYPRDGVLKGEIHQALKLKDGGHYLVEFKTIYMAKKPVQLPGYYYVDTKLDITSHNEDYTIVEQYERSEGRHHLFLYGMDELYK,dtomato,47.61,581,554,69000,,60.0,default,4.7,0.69,dtomato_default,,,,,,,,,,,b,,,,,G1DQY
m,10.1021/bi700199g,,,EBFP1.2,,,,MVSKGEELFTGVVPILVELDGDVNGHKFSVRGEGEGDATNGKLTLKFICTTGKLPVPWPTLVTTLSHGVQCFARYPDHMKQHDFFKSAMPEGYVQERTIFFKDDGTYKTRAEVKFEGDTLVNRIELKGIDFKEDGNILGHKLEYNFNSHNVYIMADKQKNGIKVNFKIRHNVEDGSVQLADHYQQNTPIGDGPVLLPDSHYLSTQSVLSKDPNEKRDHMVLLEFVTAAGITLGMDELYK,ebfp12,18.45,446,379,41000,,,default,6.6,0.45,ebfp12_default,,,,,,,,,,,b,,,,,514KE
m,10.1021/bi700199g,,,EBFP1.5,,,,MVSKGEELFTGVVPILVELDGDVNGHKFSVRGEGEGDATNGKLTLKFICTTGKLPVPWPTLVTTLSHGVQCFARYPDHMKQHDFFKSAMPEGYVQERTIFFKDDGTYKTRAEVKFEGDTLVNRIELKGIDFKEDGNILGHKLEYNHNSNNVYIAADKQKNGIKVNFKIRHNVEDGSVQLADHYQQNTPIGDGPVLLPDSHYLSTQSVLSKDPNEKRDHMVLLEFVTAAGITLGMDELYK,ebfp15,22.79,449,381,43000,,,default,4.8,0.53,ebfp15_default,,,,,,,,,,,b,,,,,XBGJO
m,10.1021/bi700199g,ABP88743,12966089,EBFP2,,,,MVSKGEELFTGVVPILVELDGDVNGHKFSVRGEGEGDATNGKLTLKFICTTGKLPVPWPTLVTTLSHGVQCFARYPDHMKQHDFFKSAMPEGYVQERTIFFKDDGTYKTRAEVKFEGDTLVNRIELKGVDFKEDGNILGHKLEYNFNSHNIYIMAVKQKNGIKVNFKIRHNVEDGSVQLADHYQQNTPIGDGPVLLPDSHYLSTQSVLSKDPNEKRDHMVLLEFRTAAGITLGMDELYK,ebfp2,17.92,448,383,32000,3.0,25.0,default,5.3,0.56,ebfp2_default,,,,,,,,,,,b,,,,,DVMQ7
m,10.1186/1741-7007-6-13,,,G1,,,,MVSKGEETTMGVIKPDMKIKLKMEGNVNGHAFVIEGEGEGKPYDGTNTINLEVKEGAPLPFSYDILTTAFAYGNRAFTKYPDDIPNYFKQSFPEGYSWERTMTFEDKGIVKVKSDISMEEDSFIYEIHLKGENFPPNGPVMQKKTTGWDASTERMYVRDGVLKGDVKMKLLLEGGGHHRVDFKTIYRAKKAVKLPDYHFVDHRIEILNHDKDYNKVTVYESAVARNSTDGMDELYK,g1,15.6,503,487,26000,,,default,,0.6,g1_default,,,,,,,,,,,b,,,,,O2UFD
m,10.1186/1741-7007-6-13,,,G2,,,,MVSKGEETTMGVIKPDMKIKLKMEGNVNGHAFVIEGEGEGKPYDGTNTINLEVKEGAPLPFSYDILTTAFAYGNRAFTKYPDDIPNYFKQSFPEGYSWERTMTFEDKGIVKVKSDISMEEDSFIYEIHLKGENFPPNGPVMQKMTTGWDASTERMYVRDGVLKGDVKMKLLLEGGGHHRVDFKTIYRAKKAVKLPDYHFVDHRIEILNHDKDYNKVTVYESAVARNSTDGMDELYK,g2,25.35,503,487,39000,,,default,,0.65,g2_default,,,,,,,,,,,b,,,,,WLCQP
m,10.1186/1741-7007-6-13,,,G3,,,,MVSKGEETTMGVIKPDMKIKLKMEGNVNGHAFVIEGEGEGKPYDGTNTINLEVKEGAPLPFSYDILTTAFAYGNRAFAKYPDDIPNYFKQSFPEGYSWERTMTFEDKGIVKVKSDISMEEDSFIYEIHLKGENFPPNGPVMQKMTTGWDASTERMYVRDGVLKGDVKMKLLLEGGGHHRVDFKTIYRAKKAVKLPDYHFVDHRIEILNHDKDYNKVTVYESAVARNSTDGMDELYK,g3,34.3,515,498,49000,,,default,,0.7,g3_default,,,,,,,,,,,b,,,,,FM76L
d,10.1002/cbic.201600492,,,GdT,,,,MVSKGEEVIKEFMRFKVRMEGSMNGHEFEIEGEGEGRPYEGTQTAKLKVTKGGPLPFAWDILSPLLMYGSKMYVKHPADIPDYKKLSFPEGFKWVRVMNFEDGGLVTATQDSSLQDGTLIYEVKMRGTNFPPDGPVMQKKTMGWEASTERLYPRDGVLKGEIHQALKLKDGGHYLVEFKTIYMAKKPVQLPGYYYVDTKLDITSHNEDYTRVEQYERSEGRHHLFLYDMDELYK,gdt,8.26,500,476,59000,,,default,3.8,0.14,dtg_default,,,,,,,,,,,b,,,,,HQZZC
m,10.1371/journal.pone.0171257,,,LSSmCherry1,,,,MVSKGEEDNMTIIKEFMRFKVHMEGSVNGHEFEIEGEGEGRPYEGTQTAKLKVTKGGPLPFAWDILSPQFMYGSKAYVKHPADIPDYLKLSFPEGFNWERVMNFEDGGVVTVTQDSSLQDGEFIYKVKLRGTNFPSDGPVMQCRTMGLEASTERMYPEDGALKGESKERLKLKDGGHYDAEVKTTYKAKKPVQLPGAYNVDIKLDILSHNEDYTIVEQYERSEGRHSTGGMDELYK,lssmcherry1,10.15,610,450,35000,,,default,6.2,0.29,lssmchery1_default,,,,,,,,,,,b,,,,,EY2GX
m,10.1038/nmeth.1207,ABW74903,13918900,mAmetrine,,,,MVSKGEELFTGVVPILVELDGDVNGHKFSVRGEGEGDATNGKLTLKFICTSGKLPVPWPTLVTTLSYGVQCFARYPDHMKQHDFFKSAMPEGYVQERTISFKDDGSYRTRAEVKFEGDTLVNRIELKGIDFKEDGNILGHKLEYNMNVWDAYITADKQKNGIKANFKIEHNVEDGGVQLADAYQQNTPIGDGSVLLPDNHYLSFQSKLFKDPNEQRDHMVLLEFVTAAGITPGMDELYK,mametrine,26.1,526,406,45000,,1.8,default,6.0,0.58,mametrine_default,,,,,,,,,,,b,,,,,DF1S4
m,10.1038/nbt1037,AAV52167,3838242,mBanana,,,,MVSKGEENNMAVIKEFMRFKVRMEGSVNGHEFEIEGEGEGRPYEGTQTAKLKVTKGGPLPFAWDILSPQFCYGSKAYVKHPTGIPDYFKLSFPEGFKWERVMNFEDGGVVTVAQDSSLQDGEFIYKVKLRGTNFPSDGPVMQKKTMGWEASSERMYPEDGALKGEIKMRLKLKDGGHYSAETKTTYKAKKPVQLPGAYIAGEKIDITSHNEDYTIVELYERAEGRHSTGGMDELYK,mbanana,4.2,553,540,6000,,60.0,default,6.7,0.7,mbanana_default,,,,,,,,,,,b,,,,,9GUD2
m,10.1021/bi700199g,,,mBlueberry1,,,,MVSKGEEDNMAIIKEFMRFKVHMEGSVNGHEFEIEGEGEGRPYEGTQTAKLKVTKGGPLPFAWDILSPQFLFGSRAYVKHPADIPDYLKLSFPEGFKWERVMNFEDGGVVTVTQDSSLQDGEFIYKVKLRGTNFPSDGPVMRRKTMGWEASSERMCPEDGALKGEIKLRLKLRDGGHYDAEVKTTYKAKKPVQLPGAYNVNIKLDITSHNEDYTIVEQYERAEGRHSTGGMDELYK,mblueberry1,5.28,452,398,11000,,,default,,0.48,mblueberry1_default,,,,,,,,,,,b,,,,,WNJAS
m,10.1021/bi700199g,,,mBlueberry2,,,,MVSKGEENNVAIIKEFMRFKVHMEGSVNGHEFEIEGEGEGRPYEGTQTAKLKVTKGGPLPFAWDILSPQFLFGSKVYIKHPADIPDYFKLSFPEGFKWERVMNFEDGGVVTVTQDSSLQDGVFIYKVKLRGTNFPSDGPVMQKKTMGWEAFSERMYPEDGALKSEIKTRLKLKDGGHYDAEVKTTYKAKKPVQLPGAYNVNIKLDIVSHNEDYTIVEQYERAEGRHSTGGMDELYK,mblueberry2,24.48,467,402,51000,,,default,2.5,0.48,mblueberry2_default,,,,,,,,,,,b,,,,,NYYN4
m,10.1038/nbt1037,AAV52164,3838123,mCherry,,2H5Q,,MVSKGEEDNMAIIKEFMRFKVHMEGSVNGHEFEIEGEGEGRPYEGTQTAKLKVTKGGPLPFAWDILSPQFMYGSKAYVKHPADIPDYLKLSFPEGFKWERVMNFEDGGVVTVTQDSSLQDGEFIYKVKLRGTNFPSDGPVMQKKTMGWEASSERMYPEDGALKGEIKQRLKLKDGGHYDAEVKTTYKAKKPVQLPGAYNVNIKLDITSHNEDYTIVEQYERAEGRHSTGGMDELYK,mcherry,15.84,610,587,72000,1.4,15.0,default,4.5,0.22,mcherry_default,,,,,,,,,,,b,,,,X5DSL3,ZERB6
m,10.1371/journal.pone.0171257,,,mCherry1.5,,,,MVSKGEEDNMAIIKEFMRFKVHMEGSVNGHEFEIEGEGEGRPYEGTQTAKLKVTKGGPLPFAWDILSPQFMYGSKAYVKHPADIPDYLKLSFPEGFNWERVMNFEDGGVVTVTQDSSLQDGEFIYKVKLRGTNFPSDGPVMQCRTMGWEASSERMYPEDGALKGEIKQRLKLKDGGHYDAEVKTTYKAKKPVQLPGAYNVDIKLDITSHNEDYTIVEQYERAEGRHSTGGMDELYK,mcherry15,,,,,,,,,,,,,,,,,,,,,,,,,,Z7ZOF
m,10.1371/journal.pone.0171257,,,mCherry2,,,,MVSKGEEDNMAIIKEFMRFKVHMEGSVNGHEFEIEGEGEGRPYEGTQTAKLKVTKGGPLPFAWDILSPQFMYGSKAYVKHPADIPDYLKLSFPEGFNWERVMNFEDGGVVTVTQDSSLQDGEFIYKVKLRGTNFPSDGPVMQCRTMGWEASTERMYPEDGALKGEIKQRLKLKDGGHYDAEVKTTYKAKKPVQLPGAYNVDIKLDILSHNEDYTIVEQYERAEGRHSTGGMDELYK,mcherry2,17.47,610,589,79400,,22.8,default,3.3,0.22,mcherry2_default,,,,,,,,,,,b,,,,,CN92E
m,10.1126/science.1068539,,,mCitrine,,,,MVSKGEELFTGVVPILVELDGDVNGHKFSVSGEGEGDATYGKLTLKFICTTGKLPVPWPTLVTTFGYGLMCFARYPDHMKQHDFFKSAMPEGYVQERTIFFKDDGNYKTRAEVKFEGDTLVNRIELKGIDFKEDGNILGHKLEYNYNSHNVYIMADKQKNGIKVNFKIRHNIEDGSVQLADHYQQNTPIGDGPVLLPDNHYLSYQSKLSKDPNEKRDHMVLLEFVTAAGITLGMDELYK,mcitrine,69.56,529,516,94000,,,default,,0.74,mcitrine_default,,,,,,,,,,,b,,,,,3Q37R
m,10.1016/j.jmb.2010.06.056,,,mClavGR1,,,,MVSKGEETTMSVIKPDMKIKLRMEGNVNGHAFVIEGEGSGKPFEGTQTIDLEVKEGAPLPFAYDILTTAFHYGNRVFTKYPDDIPDYFKQSFPEGYSWERSMTFEDGGICIATNDITMEKDSFINKIHFKGENFPPNGPVMQKKTVGWEASTEKMYVRDGVLKGDVKMKLLLKGGGHYRCDFRTTYKAKQKAVKLPDYHFVDHRIEILSHDKDYNKVKLYEHAVAHSGLPGMDELYK,mclavgr1,,,,,,,,,,,,,,,,,,,,,,,,,,9BUDR
m,10.1016/j.jmb.2010.06.056,,,mClavGR1.1,,,,MVSKGEETIMSVIKPDMKIKLRMEGNVNGHAFVIEGEGRGRPFEGTQTIDLEVKEGAPLPFAYDILTTAFHYGNRVFTRYPDDIPDYFKQSFPEGYSWERSMTFEDGGICIATNDITIEKDSFINKIHFKGENFPPNGPVMQKKTVGWEASTEKMYVRDGVLKGDVKMKLQLKGGGHHRCDFRTTYKAKQKAVKLPDYHFVDHRIEILSHDKDYNKVKLYEHAVAHSGLPGMDELYK,mclavgr11,,,,,,,,,,,,,,,,,,,,,,,,,,68QLV
m,10.1016/j.jmb.2010.06.056,,,mClavGR1.8,,,,MVSKGEETIMSVIKPDMKIKLRMEGNVNGHAFVIEGEGSGKPFEGIQTIDLEVKEGAPLPFAYDILTTAFHYGNRVFTKYPEDIPDYFKQSFPEGYSWERSMTYEDGGICIATNDITMEEDSFINKIHFKGENFPPNGPVMQKRTVGWEASTEKMYVRDGVLKGDVKMKLLLKGGGHYRCDFRTTYKVKQKAVKLPDYHFVDHRIEILSHDKDYNKVKLYEHAVAHSGLPGMDELYK,mclavgr18,,,,,,,,,,,,,,,,,,,,,,,,,,KMYOV
m,10.1016/j.jmb.2010.06.056,,,mClavGR2,,,,MVSKGEETIMSVIKPDMKIKLRMEGNVNGHAFVIEGEGSGKPFEGIQTIDLEVKEGAPLPFAYDILTTAFHYGNRVFTKYPEDIPDYFKQSFPEGYSWERSMTYEDGGICIATNDITMEEDSFINKIHFKGTNFPPNGPVMQKRTVGWEASTEKMYVRDGVLKGDVKMKLLLKGGGHYRCDFRTTYKVKQKAVKLPDYHFVDHRIEILSHDKDYNKVKLYEHAVAHSGLPGMDELYK,mclavgr2,14.63,504,488,19000,,27.0,Green,8.0,0.77,mclavgr2_green,16.96,583,566,32000,,,Red,7.3,0.53,mclavgr2_red,pc,mclavgr2_green,mclavgr2_red,405,,6LRFZ
m,10.1042/bj20060874,,,mECFP,,,,MVSKGEELFTGVVPILVELDGDVNGHKFSVSGEGEGDATYGKLTLKFICTTGKLPVPWPTLVTTLTWGVQCFSRYPDHMKQHDFFKSAMPEGYVQERTIFFKDDGNYKTRAEVKFEGDTLVNRIELKGIDFKEDGNILGHKLEYNYISHNVYITADKQKNGIKANFKIRHNIEDGSVQLADHYQQNTPIGDGPVLLPDNHYLSTQSKLSKDPNEKRDHMVLLEFVTAAGITLGMDELYK,mecfp,13.53,475,433,33000,,,default,,0.41,mecfp_default,,,,,,,,,,,b,,,,,MVN8T
m,10.1038/nbt1037,AAV52171,3838140,mHoneydew,,,,MASSEDVIKEFMRFKVRMEGSVNGHEFEIEGEGEGRPYEGTQTAKLKVTKGGPLPFAWDILSPQFMWGSKAYVKHPADIPDYLKLSFPEGFKWERVMNFEDGGVVTVTQDSSLQDGEFIYKVKLRGTNFPSDGPVMQKKTMGWAATTERMYPEDGALKGEIKMRLKLKDGGHYDAEVKTTYMAKKPVQLPGAYKIDGKLDITSHNEDYTIVEQYERAEGRHSTGA,mhoneydew,2.04,562,487,17000,,,default,4.0,0.12,mhoneydew_default,,,,,,,,,,,b,,,,,FLO5T
m,10.1021/bi700199g,ABP88742,12966091,mKalama1,,,,MVSKGEELFTGVVPILVEMDGDVNGRKFSVRGVGEGDATHGKLTLKFICTSGKLPVPWPTLVTTLSYGVQCFSRYPDHMKQHDFFKSAMPEGYVQERTIFFKDDGSYKTRAEVKFEGDTLVNRIVLKGTDFKEDGNILGHKLEYNMNVGNVYITADKQKNGIKANFEIRHNVEDGGVQLADHYQQNTPIGDGSVLLPDNHYLSVQVKLSKDPNEKRDHMVLLEFRTAAGITPGMDELYK,mkalama1,16.2,456,385,36000,,,default,5.5,0.45,mkalama1_default,,,,,,,,,,,b,,,,,TUONH
m,10.1073/pnas.1807449115,MK040731,,mKelly1,,,,MELIKENMRMKLYMEGTVGNHHFKCTAEGEGKPYEGTQTQRIKVVEGGPLPFAFDILATCFMYGSKTFINHPQGIPDFFKQSFPEGFTWERVTTYEDGGVLTVTQDTSLQDGYLIYNVKLRGVNFPSNGPVMQKKTLGWEPTTETLVPVDGGLVGRCDMALRLVGGGHLKCNLKTTYRSKKPAKNLKMPGKYQVDRKLERIKEADNETYVEQHEVAVAR,mkelly1,7.04,656,596,44000,,28.0,default,5.4,0.16,mkelly1_default,,,,,,,,,,,b,,,,,3PP3A
m,10.1073/pnas.1807449115,MK040732,,mKelly2,,,,MELIKENMRMKLYMEGTVGNHHFKCTAEGEGKPYEGTQTQRIKVVEGGPLPFAFDILATCFMYGSKTFINYPQGIPDFFKQSFPEGFTWERVTTYEDGGVLTVTQDTSLQDGYLIYNVKLRGVNFPSNGPVMQKKTLGWEPTTEYLVPVDGGLEGTCDMALRLVGGGHLKCNLKTTYRSKKPAKNLKMPGEHQVDRKLERIKEADNETYVEQHEVAVAR,mkelly2,7.74,649,598,43000,,20.0,default,5.6,0.18,mkelly2_default,,,,,,,,,,,b,,,,,T9G4X
m,10.1371/journal.pone.0051314,ASA47684,152367004,mMaple,,,,MVSKGEETIMSVIKPDMKIKLRMEGNVNGHAFVIEGEGSGKPFEGIQTIDLEVKEGAPLPFAYDILTTAFHYGNRVFTKYPEDIPDYFKQSFPEGYSWERSMTYEDGGICIATNDITMEEDSFINKIHFKGTNFPPNGPVMQKRTVGWEVSTEKMYVRDGVLKGDVKMKLLLKGGSHYRCDFRTTYKVKQKAVKLPDYHFVDHRIEILSHDKDYNKVKLYEHAVARNSTDSMDELYK,mmaple,11.1,505,489,15000,,,Green,8.2,0.74,mmaple_green,16.8,583,566,30000,,,Red,7.3,0.56,mmaple_red,pc,mmaple_green,mmaple_red,380,,SXSQ9
m,10.1074/jbc.m109.019042,,,mNectarine,,,,MVSKGEEDNMAIIKEFMRFKVHMEGSVNGHEFEIEGEGEGRPYEGTQTAKLKVTKGGPLPFAWDILSPQFCYGSKAYVKHPADIPDYLKLSFPEGFNWERVMNLEDGGVVTVTQDSSLQDGEFIYKVKLRGTNFPSDGPVMQCRTVGWEASTERMHPEDGALKGEIMQRLKLKDGGHYDAEVKTTYKAKKPVQLPGAYNVDIKLDITSHNEDYTIVELYERAEGRHSTGGMDELYK,mnectarine,26.1,578,558,58000,,30.0,default,6.9,0.45,mnectarine_default,,,,,,,,,,,b,,,,,4O71N
m,10.1016/j.chembiol.2009.10.009,ACZ95826,19025958,mNeptune,,,,MVSKGEELIKENMHMKLYMEGTVNNHHFKCTSEGEGKPYEGTQTGRIKVVEGGPLPFAFDILATCFMYGSKTFINHTQGIPDFFKQSFPEGFTWERVTTYEDGGVLTATQDTSLQDGCLIYNVKIRGVNFPSNGPVMQKKTLGWEASTETLYPADGGLEGRCDMALKLVGGGHLICNLKTTYRSKKPAKNLKMPGVYFVDRRLERIKEADKETYVEQHEVAVARYCDLPSKLGHKLNGMDELYK,mneptune,13.4,650,600,67000,,35.0,default,5.4,0.2,mneptune_default,,,,,,,,,,,b,,,,,1LT8G
m,10.1038/nbt1037,,,mOFP.T.12,,,,MVSKGEENNMAIIKEFMRFKVRMEGSVNGHEFEIEGEGEGRPYEGTQTAKLKVTKGGPLPFAWDILSPQFTYGSKAYVKHPADIPDYLKLSFPEGFKWERVMNFEDGGVVTVTQDSSLQDGEFIYKVKLRGTNFPSDGPVMQKKTMGWEASSERMYPEDGALKGEIKMRLKLKDGGHYDAEVKTTYKAKKPVQLPGAYMVSIKLDITSHNEDYTIVEQYERAEGRHSTGGMDELYK,mofpt12,,,,,,,,,,,,,,,,,,,,,,,,,,B55T2
m,10.1038/nbt1037,,,mOFP.T.8,,,,MVSKGEENNMAIIKEFMRFKVRMEGSVNGHEFEIEGEGEGRPYEGTQTAKLKVTKGGPLPFAWDILSPQFTYGSKAYVKHPADIPDYLKLSFPEGFKWERVMNFEDGGVVTVTQDSSLQDGEFIYKVKLRGTNFPSDGPVMQKKTMGWEASSERMYPEDGALKGEIKMRLKLKDGGHYDAEVKTTYKAKKPVQLPGAYKVDIKLDITSHNEDYTIVEQYERAEGRHSTGGMDELYK,mofpt8,,,,,,,,,,,,,,,,,,,,,,,,,,DUY7T
m,10.1038/nbt1037,AAV52165,3838262,mOrange,,2H5O,,MVSKGEENNMAIIKEFMRFKVRMEGSVNGHEFEIEGEGEGRPYEGFQTAKLKVTKGGPLPFAWDILSPQFTYGSKAYVKHPADIPDYFKLSFPEGFKWERVMNFEDGGVVTVTQDSSLQDGEFIYKVKLRGTNFPSDGPVMQKKTMGWEASSERMYPEDGALKGEIKMRLKLKDGGHYTSEVKTTYKAKKPVQLPGAYIVGIKLDITSHNEDYTIVEQYERAEGRHSTGGMDELYK,morange,48.99,562,548,71000,,150.0,default,6.5,0.69,morange_default,,,,,,,,,,,b,,,,,G6HDH
m,10.1016/j.chembiol.2013.08.008,AGX93076,44320375,mPapaya,,,,MVSKGEGQSKHGLKEEMTVKYHMEGCVNGHKFVITGEGIGNPFKGKQTANLCVIEGGPLPFSEDILSPGFKYGDRIFTEYPQDIVDYFKNSCPAGYTWERSYLFEDGAVCRCNVDITVSEKENCIYHKSIFRGVNFPADGPVMKKMTTNWEASTEKIVPVPKQGILKGKVKMCLLLKDGGRYHCQFDTVYKAKSVPSKMPEWHFIQHKLLREDRSDAKNQKWQLTEHAIAGMDELYK,mpapaya,35.69,541,530,43000,,,default,6.8,0.83,mpapaya_default,,,,,,,,,,,b,,,,,5LCAQ
m,10.1016/j.chembiol.2013.08.008,,,mPapaya0.3,,,,MVSKGEGHSKHGLKEEMTVKYHMEGCVNGHKFVITGEGIGNPFKGKQTANLCVIEGGPLPFSEDILSPGFKYGDRIFTEYPQDIVDYFKNSCPAGYTWERSFLFEDGAVCRCNVDITVSEKENCIYHKSIFYGVNFPADGPVMKKMTTNWEASCEKIVPVPKQGILKGKVSMYLLLKDGGRYHCQFDTVYKAKSVPSKMPEWHFIQHKLLREDRSDAKNQKWQLTEHAIAGMDELYK,mpapaya03,,,,,,,,,,,,,,,,,,,,,,,,,,6P54P
m,10.1016/j.chembiol.2013.08.008,,,mPapaya0.6,,,,MVSKGEGQSKHGLKEEMTVKYHMEGCVNGHKFVITGEGIGNPFKGKQTANLCVIEGGPLPFSEDILSPGFKYGDRIFTEYPQDIVDYFKNSCPAGYTWERSFLFEDGAVCRCNVDITVSEKENCIYHKSIFRGVNFPADGPVMKKMTTNWEASTEKIVPVPKQGILKGKVKMYLLLKDGGRYHCQFDTVYKAKSVPSKMPEWHFIQHKLLREDRSDAKNQKWQLTEHAIAGMDELYK,mpapaya06,,,,,,,,,,,,,,,,,,,,,,,,,,NYTRE
m,10.1016/j.chembiol.2013.08.008,,,mPapaya0.7,,,,MVSKGEGQSKHGLKEEMTVKYHMEGCVNGHKFVITGEGIGNPFKGKQTANLCVIEGGPLPFSEDILSPGFKYGDRIFTEYPQDIVDYFKNSCPAGYTWERSYLFEDGAVCRCNVDITVSEKENCIYHKSIFRGVNFPADGPVMKKMTTNWEASTEKIVPVPKQGILKGKVKMYLLLKDGGRYHCQFDTVYKAKSVPSKMPEWHFIQHKLLREDRSDAKNQKWQLTEHAIAGMDELYK,mpapaya07,15.87,541,529,23000,,,default,6.8,0.69,mpapaya07_default,,,,,,,,,,,b,,,,,LGDN9
m,10.1073/pnas.082243699,CAH64892,570910,mRFP1,,,,MASSEDVIKEFMRFKVRMEGSVNGHEFEIEGEGEGRPYEGTQTAKLKVTKGGPLPFAWDILSPQFQYGSKAYVKHPADIPDYLKLSFPEGFKWERVMNFEDGGVVTVTQDSSLQDGEFIYKVKLRGTNFPSDGPVMQKKTMGWEASTERMYPEDGALKGEIKMRLKLKDGGHYDAEVKTTYMAKKPVQLPGAYKTDIKLDITSHNEDYTIVEQYERAEGRHSTGA,mrfp1,12.5,607,584,50000,,60.0,default,4.5,0.25,mrfp1_default,,,,,,,,,,,b,,,,,5YCFA
m,10.1038/nbt1037,,,mRFP1.1,,,,MASSEDVIKEFMRFKVRMEGSVNGHEFEIEGEGEGRPYEGTQTAKLKVTKGGPLPFAWDILSPQFMYGSKAYVKHPADIPDYLKLSFPEGFKWERVMNFEDGGVVTVTQDSSLQDGEFIYKVKLRGTNFPSDGPVMQKKTMGWEASSERMYPEDGALKGEIKMRLKLKDGGHYDAEVKTTYMAKKPVQLPGAYKTDIKLDITSHNEDYTIVEQYERAEGRHSTGA,mrfp11,,612,589,,,,default,,,mrfp11_default,,,,,,,,,,,b,,,,,EY795
m,10.1038/nbt1037,,,mRFP1.3,,,,MVSKGEENNMAVIKEFMRFKVRMEGSVNGHEFEIEGEGEGRPYEGTQTAKLKVTKGGPLPFAWDILSPQFMYGSKAYVKHPADIPDYLKLSFPEGFKWERVMNFEDGGVVTVTQDSSLQDGEFIYKVKLRGTNFPSDGPVMQKKTMGWEASSERMYPEDGALKGEIKMRLKLKDGGHYDAEVKTTYMAKKPVQLPGAYKTDIKLDITSHNEDYTIVEQYERAEGRHSTGGMDELYK,mrfp13,,,,,,,,,,,,,,,,,,,,,,,,,,5OR4S
m,10.1038/nbt1037,,,mRFP1.4,,,,MVSKGEENNMAIIKEFMRFKVRMEGSVNGHEFEIEGEGEGRPYEGTQTAKLKVTKGGPLPFAWDILSPQFMYGSKAYVKHPADIPDYLKLSFPEGFKWERVMNFEDGGVVTVTQDSSLQDGEFIYKVKLRGTNFPSDGPVMQKKTMGWEASSERMYPEDGALKGEIKMRLKLKDGGHYDAEVKTTYKAKKPVQLPGAYKTDIKLDITSHNEDYTIVEQYERAEGRHSTGGMDELYK,mrfp14,,,,,,,,,,,,,,,,,,,,,,,,,,NWMCV
m,10.1038/nbt1037,,,mRFP1.5,,,,MVSKGEENNMAIIKEFMRFKVHMEGSVNGHEFEIEGEGEGRPYEGTQTAKLKVTKGGPLPFAWDILSPQFMYGSKAYVKHPADIPDYLKLSFPEGFKWERVMNFEDGGVVTVTQDSSLQDGEFIYKVKLRGTNFPSDGPVMQKKTMGWEASSERMYPEDGALKGEIKQRLKLKDGGHYDAEVKTTYKAKKPVQLPGAYKTDIKLDITSHNEDYTIVEQYERAEGRHSTGGMDELYK,mrfp15,,,,,,,,,,,,,,,,,,,,,,,,,,MO63Q
m,10.1038/nbt1037,,,mStrawberry,,2H5R,,MVSKGEENNMAIIKEFMRFKVRMEGSVNGHEFEIEGEGEGRPYEGTQTAKLKVTKGGPLPFAWDILTPNFTYGSKAYVKHPADIPDYLKLSFPEGFKWERVMNFEDGGVVTVTQDSSLQDGEFIYKVKLRGTNFPSDGPVMQKKTMGWEASSERMYPEDGALKGEIKMRLKLKDGGHYDAEVKTTYKAKKPVQLPGAYIVGIKLDITSHNEDYTIVELYERAEGRHSTGGMDELYK,mstrawberry,26.1,596,574,90000,,50.0,default,4.5,0.29,mstrawberry_default,,,,,,,,,,,b,,,,,TN3DM
m,10.1038/nbt1037,AAV52170,3838142,mTangerine,,,,MASSEDVIKEFMRFKVRMEGSVNGHEFEIEGEGEGRPYEGTQTAKLKVTKGGPLPFAWDILSPQFCYGSKAYVKHPADIPDYLKLSFPEGFKWERVMNFEDGGVVTVTQDSSLQDGEFIYKVKLRGTNFPSDGPVMQKKTMGWEASSERMYPEDGALKGEIKMRLKLKDGGHYDAEVKTTYMAKKPVQLPGAYKTDIKLDITSHNEDYTIVELYERAEGRHSTGA,mtangerine,11.4,585,568,38000,,,default,5.7,0.3,mtangerine_default,,,,,,,,,,,b,,,,,N63O3
m,10.1042/bj20060874,,,mTFP0.3,,,,MVSKGEETTMGVIKPDMKIKLKMEGNVNGHAFVIEGEGEGKPYDGTNTVNLEVKEGAPLPFSYDILSNAFQYGNRAFTKYPDDIANYFKQSFPEGYSWERTMTFEDKGIVKVKSDISMEEDSFIYEIRLKGKNFPPNGPVMQKKTLKWEPSTEILYVRDGVLVGDIKHKLLLEGGGHYRCDFKTIYKAKKVVKLPDYHFVDHRIEILNHDKDYNKVTLYENAVARYSLLPPQAGMDELYK,mtfp03,5.89,488,458,19000,,,default,,0.31,mtfp03_default,,,,,,,,,,,b,,,,,8PKAY
m,10.1042/bj20060874,,,mTFP0.4,,,,MVSKGEETTMGVIKPDMKIKLKMEGNVNGHAFVIEGEGEGKPYDGTNTVNLEVKEGAPLPFSYDILSNAFCYGNRAFTKYPDDIANYFKQSFPEGYSWERTMTFEDKGIVKVKSDISMEEDSFIYEIRLKGKNFPPNGPVMQKKTLKWEPSTEILYVRDGVLVGDIKHKLLLEGGGHYRVDFKTIYKAKKVVKLPDYHFVDHRIEILNHDKDYNKVTLYENAVARYSLLPPQAGMDELYK,mtfp04,,,,,,,,,,,,,,,,,,,,,,,,,,UEQO7
m,10.1042/bj20060874,,,mTFP0.5,,,,MVSKGEETTMGVIKPDMKIKLKMEGNVNGHAFVIEGEGEGKPYDGTNTVNLEVKEGAPLPFSYDILTNAFGYGNRAFTKYPDDIPNYFKQSFPEGYSWERTMTFEDKGIVKVKSDISMEEDSFIYEIRLKGENFPPNGPVMQKKTLKWEPSTEILYVRDGVLVGDIKHKLLLEGGGHYRVDFKTIYRAKKVVKLPDYHFVDHRIEILNHDKDYNKVTLYESAVARYSLLPPQAGMDELYK,mtfp05,,,,,,,,,,,,,,,,,,,,,,,,,,86LQ4
m,10.1042/bj20060874,,,mTFP0.6,,,,MVNKGEETTMGVIKPDMKIKLKMEGNVNGHAFVIEGEGEGKPYDGTNTVNLEVKEGAPLPFSYDILTNAFAYGNRAFTKYPDDIPNYFKQSFPEGYSWERTMTFEDKGIVKVKSDISMEEDSFIYEIRLKGENFPPNGPVMQKKTLKWEPSTEILYVRDGVLVGDIKHKLLLEGGGHYRVDFKTIYRAKKVVKLPDYHFVDHRIEILNHDKDYNKVTVYESAVARYSTGGMDELYK,mtfp06,,,,,,,,,,,,,,,,,,,,,,,,,,9C29V
m,10.1042/bj20060874,,,mTFP0.7,,2OTE,2OTB,MVSKGEETTMGVIKPDMKIKLKMEGNVNGHAFVIEGEGEGKPYDGTNTINLEVKEGAPLPFSYDILTNAFAYGNRAFTKYPDDIPNYFKQSFPEGYSWERTMTFEDKGIVKVKSDISMEEDSFIYEIHLKGENFPPNGPVMQKKTLKWEPSTEILYVRDGVLVGDIKHKLLLEGGGHHRVDFKTIYRAKKAVKLPDYHFVDHRIEILNHDKDYNKVTVYESAVARYSTGGMDELYK,mtfp07,,,,,,,Off,,,mtfp07_off,30.0,488,453,60000,,,On,,0.5,mtfp07_on,o,,,,,2HEJS
m,10.1042/bj20060874,,,mTFP0.8,,,,MVSKGEETTMGVIKPDMKIKLKMEGNVNGHAFVIEGEGEGKPYDGTNTINLEVKEGAPLPFSYDILTTAFAYGNRAFTKYPDDIPNYFKQSFPEGYSWERTMTFEDKGIVKVKSDISMEEDSFIYEIHLKGENFPPNGPVMQKKTLKWEPSTEILYVRDGVLVGDIKHKLLLEGGGHHRVDFKTIYRAKKAVKLPDYHFVDHRIEILNHDKDYNKVTVYESAVARYSTGGMDELYK,mtfp08,,,,,,,,,,,,,,,,,,,,,,,,,,J862W
m,10.1042/bj20060874,,,mTFP0.9,,,,MVSKGEETTMGVIKPDMKIKLKMEGNVNGHAFVIEGEGEGKPYDGTNTINLEVKEGAPLPFSYDILTTAFAYGNRAFTKYPDDIPNYFKQSFPEGYSWERTMTFEDKGIVKVKSDISMEEDSFIYEIHLKGENFPPNGPVMQKKTLGWDASTERMYVRDGVLVGDVKHKLLLEGGGHHRVDFKTIYRAKKAVKLPDYHFVDHRIEILNHDKDYNKVTVYESAVARYSTGGMDELYK,mtfp09,,,,,,,,,,,,,,,,,,,,,,,,,,YBGRL
m,10.1042/bj20060874,ABG77397,5860107,mTFP1,,2HQK,,MVSKGEETTMGVIKPDMKIKLKMEGNVNGHAFVIEGEGEGKPYDGTNTINLEVKEGAPLPFSYDILTTAFAYGNRAFTKYPDDIPNYFKQSFPEGYSWERTMTFEDKGIVKVKSDISMEEDSFIYEIHLKGENFPPNGPVMQKKTTGWDASTERMYVRDGVLKGDVKHKLLLEGGGHHRVDFKTIYRAKKAVKLPDYHFVDHRIEILNHDKDYNKVTVYESAVARNSTDGMDELYK,mtfp1,54.4,492,462,64000,3.2,,default,4.3,0.85,mtfp1_default,,,,,,,,,,,b,,,,,ASSY9
m,10.1186/1741-7007-6-13,,,mTFP1-Y67H,,,,MVSKGEETTMGVIKPDMKIKLKMEGNVNGHAFVIEGEGEGKPYDGTNTINLEVKEGAPLPFSYDILTTAFAHGNRAFTKYPDDIPNYFKQSFPEGYSWERTMTFEDKGIVKVKSDISMEEDSFIYEIHLKGENFPPNGPVMQKKTTGWDASTERMYVRDGVLKGDVKHKLLLEGGGHHRVDFKTIYRAKKAVKLPDYHFVDHRIEILNHDKDYNKVTVYESAVARNSTDGMDELYK,mtfp1-y67h,,,,,,,,,,,,,,,,,,,,,,,,,,KQ1PU
m,10.1186/1741-7007-6-13,,,mTFP1-Y67W,,,,MVSKGEETTMGVIKPDMKIKLKMEGNVNGHAFVIEGEGEGKPYDGTNTINLEVKEGAPLPFSYDILTTAFAWGNRAFTKYPDDIPNYFKQSFPEGYSWERTMTFEDKGIVKVKSDISMEEDSFIYEIHLKGENFPPNGPVMQKKTTGWDASTERMYVRDGVLKGDVKHKLLLEGGGHHRVDFKTIYRAKKAVKLPDYHFVDHRIEILNHDKDYNKVTVYESAVARNSTDGMDELYK,mtfp1-y67w,0.06,461,424,3000,,,default,,0.02,mtfp1-y67w_default,,,,,,,,,,,b,,,,,4JYN3
m,10.1038/nmeth.1207,,,mT-Sapphire,,,,MVSKGEELFTGVVPILVELDGDVNGHKFSVSGEGEGDATYGKLTLKFICTTGKLPVPWPTLVTTFSYGVMVFARYPDHMKQHDFFKSAMPEGYVQERTIFFKDDGNYKTRAEVKFEGDTLVNRIELKGIDFKEDGNILGHKLEYNFNSHNVYIMADKQKNGIKANFKIRHNIEDGGVQLADHYQQNTPIGDGPVLLPDNHYLSIQSKLSKDPNEKRDHMVLLEFVTAAGITLGMDELYK,mt-sapphire,26.4,511,399,44000,,156.5,default,4.9,0.6,mt-sapphire_default,,,,,,,,,,,b,,,,,KSK4V
m,10.1186/1741-7007-6-13,ABW74902.1,,mWasabi,,,,MVSKGEETTMGVIKPDMKIKLKMEGNVNGHAFVIEGEGEGKPYDGTNTINLEVKEGAPLPFSYDILTTAFSYGNRAFTKYPDDIPNYFKQSFPEGYSWERTMTFEDKGIVKVKSDISMEEDSFIYEIHLKGENFPPNGPVMQKETTGWDASTERMYVRDGVLKGDVKMKLLLEGGGHHRVDFKTIYRAKKAVKLPDYHFVDHRIEILNHDKDYNKVTVYEIAVARNSTDGMDELYK,mwasabi,56.0,509,493,70000,,,default,6.5,0.8,mwasabi_default,,,,,,,,,,,b,,,,,QTBVW
m,10.1083/jcb.201404107,,,pHuji,,,,MVSKGEENNMAIIKEFMRFKVHMEGSVNGHEFEIEGEGEGRPYEAFQTAKLKVTKGGPLPFAWDILSPQFMYGSKVYIKHPADIPDYFKLSFPEGFRWERVMNFEDGGIIHVNQDSSLQDGVFIYKVKLRGTNFPSDGPVMQKKTMGWEASEERMYPEDGALYSEIKKRLKLKDGGHYAAEVKTTYKAKKPVQLPGAYIVDIKLDIVSHNEDYTIVEQYERAEGRHSTGGMDELYK,phuji,6.82,598,566,31000,,,default,7.7,0.22,phuji_default,,,,,,,,,,,b,,,,,SS15T