agg,doi,genbank,ipg_id,name,pdb.0,pdb.1,seq,slug,states.0.brightness,states.0.em_max,states.0.ex_max,states.0.ext_coeff,states.0.lifetime,states.0.maturation,states.0.name,states.0.pka,states.0.qy,states.0.slug,switch_type,uniprot,uuid
t,10.3354/meps07588,ACH89427,15616241,amilFP497,,,MSYSKQGIVQAMKTKYHMEGSVNGHEFTIEGVGTGNPYEGTQMSELVITKPAGKPLPFSFDILSTVFQYGNRCFTKYPEGMTDYFKQAFPDGMSYERSFLFEDGGVATASWNIRLEGDCFIHKSIYHGVNFPADGPVMKKKTIGWEKSFEKMTVSKDVLRGDVTMFLMLEGGGYHRCQFHSTYKPEKPGTLPPNHVVEHHIVRTDLGQSAKGFTVKLEEHAAAHVNPLKVK,amilfp497,,497,477,,,,default,,,amilfp497_default,b,B5T1L3,VGW8W
m,10.1038/nbt.3550,KU530233,,CyOFP1,,,MVSKGEELIKENMRSKLYLEGSVNGHQFKCTHEGEGKPYEGKQTNRIKVVEGGPLPFAFDILATHFMYGSKVFIKYPADLPDYFKQSFPEGFTWERVMVFEDGGVLTATQDTSLQDGELIYNVKVRGVNFPANGPVMQKKTLGWEPSTETMYPADGGLEGRCDKALKLVGGGHLHVNFKTTYKSKKPVKMPGVHYVDRRLERIKEADNETYVEQYEHAVARYSNLGGGMDELYK,cyofp1,30.4,589,497,40000,3.6,15.0,default,5.5,0.76,cyofp1_default,b,,TL112
m,10.1016/s0960-9822(02)00450-5,,,ECFP,5OX8,2WSN,MVSKGEELFTGVVPILVELDGDVNGHKFSVSGEGEGDATYGKLTLKFICTTGKLPVPWPTLVTTLTWGVQCFSRYPDHMKQHDFFKSAMPEGYVQERTIFFKDDGNYKTRAEVKFEGDTLVNRIELKGIDFKEDGNILGHKLEYNYISHNVYITADKQKNGIKANFKIRHNIEDGSVQLADHYQQNTPIGDGPVLLPDNHYLSTQSALSKDPNEKRDHMVLLEFVTAAGITLGMDELYK,ecfp,13.0,477,434,32500,3.0,,default,4.7,0.4,ecfp_default,b,,27HOS
wd,10.1126/science.273.5280.1392,,,EYFP,,,MVSKGEELFTGVVPILVELDGDVNGHKFSVSGEGEGDATYGKLTLKFICTTGKLPVPWPTLVTTFGYGLQCFARYPDHMKQHDFFKSAMPEGYVQERTIFFKDDGNYKTRAEVKFEGDTLVNRIELKGIDFKEDGNILGHKLEYNYNSHNVYIMADKQKNGIKVNFKIRHNIEDGSVQLADHYQQNTPIGDGPVLLPDNHYLSYQSALSKDPNEKRDHMVLLEFVTAAGITLGMDELYK,eyfp,44.89,527,513,67000,3.1,9.0,default,6.9,0.67,eyfp_default,b,,8DNLG
wd,10.1016/0378-1119(95)00685-0,AAB18957.1,,GFPmut3,,,MSKGEELFTGVVPILVELDGDVNGHKFSVSGEGEGDATYGKLTLKFICTTGKLPVPWPTLVTTFGYGVQCFARYPDHMKQHDFFKSAMPEGYVQERTIFFKDDGNYKTRAEVKFEGDTLVNRIELKGIDFKEDGNILGHKLEYNYNSHNVYIMADKQKNGIKVNFKIRHNIEDGSVQLADHYQQNTPIGDGPVLLPDNHYLSTQSALSKDPNEKRDHMVLLEFVTAAGITHGMDELYK,gfpmut3,22.69,513,506,58191,,4.1,default,,0.39,gfpmut3_default,b,,A2OWC
m,10.1038/nbt1037,AAV52164,3838123,mCherry,2H5Q,,MVSKGEEDNMAIIKEFMRFKVHMEGSVNGHEFEIEGEGEGRPYEGTQTAKLKVTKGGPLPFAWDILSPQFMYGSKAYVKHPADIPDYLKLSFPEGFKWERVMNFEDGGVVTVTQDSSLQDGEFIYKVKLRGTNFPSDGPVMQKKTMGWEASSERMYPEDGALKGEIKQRLKLKDGGHYDAEVKTTYKAKKPVQLPGAYNVNIKLDITSHNEDYTIVEQYERAEGRHSTGGMDELYK,mcherry,15.84,610,587,72000,1.4,15.0,default,4.5,0.22,mcherry_default,b,X5DSL3,ZERB6
m,10.1042/bj20081949,,,mKate2,,,MVSELIKENMHMKLYMEGTVNNHHFKCTSEGEGKPYEGTQTMRIKAVEGGPLPFAFDILATSFMYGSKTFINHTQGIPDFFKQSFPEGFTWERVTTYEDGGVLTATQDTSLQDGCLIYNVKIRGVNFPSNGPVMQKKTLGWEASTETLYPADGGLEGRADMALKLVGGGHLICNLKTTYRSKKPAKNLKMPGVYYVDRRLERIKEADKETYVEQHEVAVARYCDLPSKLGHR,mkate2,25.0,633,588,62500,2.5,20.0,default,5.4,0.4,mkate2_default,b,,DBBO8
m,10.1073/pnas.082243699,CAH64892,570910,mRFP1,,,MASSEDVIKEFMRFKVRMEGSVNGHEFEIEGEGEGRPYEGTQTAKLKVTKGGPLPFAWDILSPQFQYGSKAYVKHPADIPDYLKLSFPEGFKWERVMNFEDGGVVTVTQDSSLQDGEFIYKVKLRGTNFPSDGPVMQKKTMGWEASTERMYPEDGALKGEIKMRLKLKDGGHYDAEVKTTYMAKKPVQLPGAYKTDIKLDITSHNEDYTIVEQYERAEGRHSTGA,mrfp1,12.5,607,584,50000,,60.0,default,4.5,0.25,mrfp1_default,b,,5YCFA
m,10.1038/nmeth.4074,APD76536,129830965,mScarlet-I,,,MVSKGEAVIKEFMRFKVHMEGSMNGHEFEIEGEGEGRPYEGTQTAKLKVTKGGPLPFSWDILSPQFMYGSRAFIKHPADIPDYYKQSFPEGFKWERVMNFEDGGAVTVTQDTSLEDGTLIYKVKLRGTNFPPDGPVMQKKTMGWEASTERLYPEDGVLKGDIKMALRLKDGGRYLADFKTTYKAKKPVQMPGAYNVDRKLDITSHNEDYTVVEQYERSEGRHSTGGMDELYK,mscarlet-i,56.16,593,569,104000,3.1,36.0,default,5.4,0.54,mscarlet-i_default,b,,6VVTK
m,10.1371/journal.pone.0028674,,,mTagBFP2,,,MVSKGEELIKENMHMKLYMEGTVDNHHFKCTSEGEGKPYEGTQTMRIKVVEGGPLPFAFDILATSFLYGSKTFINHTQGIPDFFKQSFPEGFTWERVTTYEDGGVLTATQDTSLQDGCLIYNVKIRGVNFTSNGPVMQKKTLGWEAFTETLYPADGGLEGRNDMALKLVGGSHLIANAKTTYRSKKPAKNLKMPGVYYVDYRLERIKEANNETYVEQHEVAVARYCDLPSKLGHKLN,mtagbfp2,32.38,454,399,50600,2.6,12.0,default,2.7,0.64,mtagbfp2_default,b,,ZO7NN
wd,10.1038/nbt1172,ASL68970,154375264,Superfolder GFP,2B3P,2Q6P,MSKGEELFTGVVPILVELDGDVNGHKFSVRGEGEGDATNGKLTLKFICTTGKLPVPWPTLVTTLTYGVQCFSRYPDHMKRHDFFKSAMPEGYVQERTISFKDDGTYKTRAEVKFEGDTLVNRIELKGIDFKEDGNILGHKLEYNFNSHNVYITADKQKNGIKANFKIRHNVEDGSVQLADHYQQNTPIGDGPVLLPDNHYLSTQSVLSKDPNEKRDHMVLLEFVTAAGITHGMDELYK,superfolder-gfp,54.15,510,488,83300,3.1,13.6,default,,0.65,superfolder-gfp_default,b,,B4SOW
