agg,doi,genbank,ipg_id,name,pdb.0,seq,slug,states.0.brightness,states.0.em_max,states.0.ex_max,states.0.ext_coeff,states.0.lifetime,states.0.maturation,states.0.name,states.0.pka,states.0.qy,states.0.slug,switch_type,uniprot,uuid
d,10.1038/nbt1037,AAV52168,3838230,dTomato,,MVSKGEEVIKEFMRFKVRMEGSMNGHEFEIEGEGEGRPYEGTQTAKLKVTKGGPLPFAWDILSPQFMYGSKAYVKHPADIPDYKKLSFPEGFKWERVMNFEDGGLVTVTQDSSLQDGTLIYKVKMRGTNFPPDGPVMQKKTMGWEASTERLYPRDGVLKGEIHQALKLKDGGHYLVEFKTIYMAKKPVQLPGYYYVDTKLDITSHNEDYTIVEQYERSEGRHHLFLYGMDELYK,dtomato,47.61,581,554,69000,,60.0,default,4.7,0.69,dtomato_default,b,,G1DQY
m,10.1038/nmeth.1209,ABC66097,,mApple,,MVSKGEENNMAIIKEFMRFKVHMEGSVNGHEFEIEGEGEGRPYEAFQTAKLKVTKGGPLPFAWDILSPQFMYGSKVYIKHPADIPDYFKLSFPEGFRWERVMNFEDGGIIHVNQDSSLQDGVFIYKVKLRGTNFPSDGPVMQKKTMGWEASEERMYPEDGALKSEIKKRLKLKDGGHYAAEVKTTYKAKKPVQLPGAYIVDIKLDIVSHNEDYTIVEQYERAEGRHSTGGMDELYK,mapple,36.75,592,568,75000,2.9,30.0,default,6.5,0.49,mapple_default,b,,T5UGO
m,10.1038/nbt1037,AAV52167,3838242,mBanana,,MVSKGEENNMAVIKEFMRFKVRMEGSVNGHEFEIEGEGEGRPYEGTQTAKLKVTKGGPLPFAWDILSPQFCYGSKAYVKHPTGIPDYFKLSFPEGFKWERVMNFEDGGVVTVAQDSSLQDGEFIYKVKLRGTNFPSDGPVMQKKTMGWEASSERMYPEDGALKGEIKMRLKLKDGGHYSAETKTTYKAKKPVQLPGAYIAGEKIDITSHNEDYTIVELYERAEGRHSTGGMDELYK,mbanana,4.2,553,540,6000,,60.0,default,6.7,0.7,mbanana_default,b,,9GUD2
m,10.1021/bi700199g,,,mBlueberry1,,MVSKGEEDNMAIIKEFMRFKVHMEGSVNGHEFEIEGEGEGRPYEGTQTAKLKVTKGGPLPFAWDILSPQFLFGSRAYVKHPADIPDYLKLSFPEGFKWERVMNFEDGGVVTVTQDSSLQDGEFIYKVKLRGTNFPSDGPVMRRKTMGWEASSERMCPEDGALKGEIKLRLKLRDGGHYDAEVKTTYKAKKPVQLPGAYNVNIKLDITSHNEDYTIVEQYERAEGRHSTGGMDELYK,mblueberry1,5.28,452,398,11000,,,default,,0.48,mblueberry1_default,b,,WNJAS
m,10.1038/nbt1037,AAV52164,3838123,mCherry,2H5Q,MVSKGEEDNMAIIKEFMRFKVHMEGSVNGHEFEIEGEGEGRPYEGTQTAKLKVTKGGPLPFAWDILSPQFMYGSKAYVKHPADIPDYLKLSFPEGFKWERVMNFEDGGVVTVTQDSSLQDGEFIYKVKLRGTNFPSDGPVMQKKTMGWEASSERMYPEDGALKGEIKQRLKLKDGGHYDAEVKTTYKAKKPVQLPGAYNVNIKLDITSHNEDYTIVEQYERAEGRHSTGGMDELYK,mcherry,15.84,610,587,72000,1.4,15.0,default,4.5,0.22,mcherry_default,b,X5DSL3,ZERB6
m,10.1126/science.1068539,,,mCitrine,,MVSKGEELFTGVVPILVELDGDVNGHKFSVSGEGEGDATYGKLTLKFICTTGKLPVPWPTLVTTFGYGLMCFARYPDHMKQHDFFKSAMPEGYVQERTIFFKDDGNYKTRAEVKFEGDTLVNRIELKGIDFKEDGNILGHKLEYNYNSHNVYIMADKQKNGIKVNFKIRHNIEDGSVQLADHYQQNTPIGDGPVLLPDNHYLSYQSKLSKDPNEKRDHMVLLEFVTAAGITLGMDELYK,mcitrine,69.56,529,516,94000,,,default,,0.74,mcitrine_default,b,,3Q37R
m,10.1016/j.chembiol.2009.10.009,,,mGrape1,,MASSEDVIKEFMRFKVRMEGSVNGHEFEIEGEGEGRPYEGTQTAKLKVTKGGPLPFAWDILSPQFMYGSKAYVKHPADIPDYLKLSFPEGFKWERVMNFEDGGVVTVTQDSSLQDGEFIYKVKLRGTNFPSDGPVMQKKTMGWEASSERLYPEDGALKGEIKMRLKLKDGGHYDAEAKTTYMAKKPVQLPGAYKLDYKLDITSHNEDYTIVEQYERAEGRHSTGA,mgrape1,1.5,625,595,50000,,70.0,default,4.5,0.03,mgrape1_default,b,,AL871
m,10.1038/nbt1037,AAV52171,3838140,mHoneydew,,MASSEDVIKEFMRFKVRMEGSVNGHEFEIEGEGEGRPYEGTQTAKLKVTKGGPLPFAWDILSPQFMWGSKAYVKHPADIPDYLKLSFPEGFKWERVMNFEDGGVVTVTQDSSLQDGEFIYKVKLRGTNFPSDGPVMQKKTMGWAATTERMYPEDGALKGEIKMRLKLKDGGHYDAEVKTTYMAKKPVQLPGAYKIDGKLDITSHNEDYTIVEQYERAEGRHSTGA,mhoneydew,2.04,562,487,17000,,,default,4.0,0.12,mhoneydew_default,b,,FLO5T
m,10.1074/jbc.m109.019042,,,mNectarine,,MVSKGEEDNMAIIKEFMRFKVHMEGSVNGHEFEIEGEGEGRPYEGTQTAKLKVTKGGPLPFAWDILSPQFCYGSKAYVKHPADIPDYLKLSFPEGFNWERVMNLEDGGVVTVTQDSSLQDGEFIYKVKLRGTNFPSDGPVMQCRTVGWEASTERMHPEDGALKGEIMQRLKLKDGGHYDAEVKTTYKAKKPVQLPGAYNVDIKLDITSHNEDYTIVELYERAEGRHSTGGMDELYK,mnectarine,26.1,578,558,58000,,30.0,default,6.9,0.45,mnectarine_default,b,,4O71N
m,10.1038/nmeth.1209,ABC66096,5194148,mOrange2,,MVSKGEENNMAIIKEFMRFKVRMEGSVNGHEFEIEGEGEGRPYEGFQTAKLKVTKGGPLPFAWDILSPHFTYGSKAYVKHPADIPDYFKLSFPEGFKWERVMNYEDGGVVTVTQDSSLQDGEFIYKVKLRGTNFPSDGPVMQKKTMGWEASSERMYPEDGALKGKIKMRLKLKDGGHYTSEVKTTYKAKKPVQLPGAYIVDIKLDITSHNEDYTIVEQYERAEGRHSTGGMDELYK,morange2,34.8,565,549,58000,2.7,270.0,default,6.5,0.6,morange2_default,b,,5GR1V
m,10.1016/j.chembiol.2013.08.008,AGX93076,44320375,mPapaya,,MVSKGEGQSKHGLKEEMTVKYHMEGCVNGHKFVITGEGIGNPFKGKQTANLCVIEGGPLPFSEDILSPGFKYGDRIFTEYPQDIVDYFKNSCPAGYTWERSYLFEDGAVCRCNVDITVSEKENCIYHKSIFRGVNFPADGPVMKKMTTNWEASTEKIVPVPKQGILKGKVKMCLLLKDGGRYHCQFDTVYKAKSVPSKMPEWHFIQHKLLREDRSDAKNQKWQLTEHAIAGMDELYK,mpapaya,35.69,541,530,43000,,,default,6.8,0.83,mpapaya_default,b,,5LCAQ
m,10.1073/pnas.0407752101,AAV65487,3876945,mPlum,2QLG,MVSKGEEVIKEFMRFKEHMEGSVNGHEFEIEGEGEGRPYEGTQTARLKVTKGGPLPFAWDILSPQIMYGSKAYVKHPADIPDYLKLSFPEGFKWERVMNFEDGGVVTVTQDSSLQDGEFIYKVKVRGTNFPSDGPVMQKKTMGWEASSERMYPEDGALKGEMKMRLRLKDGGHYDAEVKTTYMAKKPVQLPGAYKTDIKLDITSHNEDYTIVEQYERAEGRHSTGA,mplum,4.1,649,590,41000,,100.0,default,4.5,0.1,mplum_default,b,Q5S3G7,XU2WO
m,10.1073/pnas.0407752101,AAV65486,3877009,mRaspberry,,MVSKGEEVIKEFMRFKVRMEGSVNGHEFEIEGEGEGRPYEGTQTAKLKVTKGGPLPFAWDILSPQCMYGSKGYVKHPADIPDYLKLSFPEGFKWERVMNFEDGGVVTVTQDSSLQDGEFIYKVKLRGTNFPSDGPVMQKKTMGWEASSERMYPEDGALKGEMKMRLKLKDGGHYDAEVKTTYMAKKPVQLPGAYKTDIKLDITSHNEDYTIVEQYERAEGRHSTGA,mraspberry,12.9,625,598,86000,,,default,,0.15,mraspberry_default,b,Q5S3G8,V5FM2
m,10.1038/nbt1037,,,mStrawberry,2H5R,MVSKGEENNMAIIKEFMRFKVRMEGSVNGHEFEIEGEGEGRPYEGTQTAKLKVTKGGPLPFAWDILTPNFTYGSKAYVKHPADIPDYLKLSFPEGFKWERVMNFEDGGVVTVTQDSSLQDGEFIYKVKLRGTNFPSDGPVMQKKTMGWEASSERMYPEDGALKGEIKMRLKLKDGGHYDAEVKTTYKAKKPVQLPGAYIVGIKLDITSHNEDYTIVELYERAEGRHSTGGMDELYK,mstrawberry,26.1,596,574,90000,,50.0,default,4.5,0.29,mstrawberry_default,b,,TN3DM
m,10.1038/nbt1037,AAV52170,3838142,mTangerine,,MASSEDVIKEFMRFKVRMEGSVNGHEFEIEGEGEGRPYEGTQTAKLKVTKGGPLPFAWDILSPQFCYGSKAYVKHPADIPDYLKLSFPEGFKWERVMNFEDGGVVTVTQDSSLQDGEFIYKVKLRGTNFPSDGPVMQKKTMGWEASSERMYPEDGALKGEIKMRLKLKDGGHYDAEVKTTYMAKKPVQLPGAYKTDIKLDITSHNEDYTIVELYERAEGRHSTGA,mtangerine,11.4,585,568,38000,,,default,5.7,0.3,mtangerine_default,b,,N63O3
m,10.1186/1741-7007-6-13,ABW74902.1,,mWasabi,,MVSKGEETTMGVIKPDMKIKLKMEGNVNGHAFVIEGEGEGKPYDGTNTINLEVKEGAPLPFSYDILTTAFSYGNRAFTKYPDDIPNYFKQSFPEGYSWERTMTFEDKGIVKVKSDISMEEDSFIYEIHLKGENFPPNGPVMQKETTGWDASTERMYVRDGVLKGDVKMKLLLEGGGHHRVDFKTIYRAKKAVKLPDYHFVDHRIEILNHDKDYNKVTVYEIAVARNSTDGMDELYK,mwasabi,56.0,509,493,70000,,,default,6.5,0.8,mwasabi_default,b,,QTBVW
