agg,doi,genbank,ipg_id,name,pdb.0,pdb.1,pdb.2,pdb.3,seq,slug,states.0.brightness,states.0.em_max,states.0.ex_max,states.0.ext_coeff,states.0.lifetime,states.0.maturation,states.0.name,states.0.pka,states.0.qy,states.0.slug,states.1.brightness,states.1.em_max,states.1.ex_max,states.1.ext_coeff,states.1.lifetime,states.1.maturation,states.1.name,states.1.pka,states.1.qy,states.1.slug,states.2.brightness,states.2.em_max,states.2.ex_max,states.2.ext_coeff,states.2.lifetime,states.2.maturation,states.2.name,states.2.pka,states.2.qy,states.2.slug,switch_type,transitions.0.from_state,transitions.0.to_state,transitions.0.trans_wave,transitions.1.from_state,transitions.1.to_state,transitions.1.trans_wave,transitions.2.from_state,transitions.2.to_state,transitions.2.trans_wave,uniprot,uuid
t,10.1371/journal.pone.0002680,AAU06845,3620755,aacuGFP2,,,,,MSYSKQGIVQEMKTKYRMEGSVNGHEFTIEGVGTGYPYEGKQMSELVIIKPKGKPLPFSFDILSSVFQYGNRCFTKYPADMPDYFKQAFPDGMSYERSFLFEDGAVATASWNIRLEGNCFIHNSIFHGVNFPADGPVMKKKTIGWDKSFEKMTVSKEVLRGDVTMFLMLEGGGYHRCQFHSTYKTEKPVELPPNHVVEHQIVRTDLGQSAKGFTVKLEAHAAAHVNPLKVQ,aacugfp2,66.67,513,502,93900,,,default,,0.71,aacugfp2_default,,,,,,,,,,,,,,,,,,,,,b,,,,,,,,,,Q66PV9,3W5ZV
d,10.1101/677344,,,AausFP1,,,,,MSYGALLFREKIPYVVEMEGDVEGMKFSVRGKGHGDANTGKIEASFICTTGELPVPWSSILTTVTYGAQCFAKYPNDIKDYPKSAMPEGYVQERTITFENDGVYKTRAEVTYEKGSVYNRVTLNGSGFKKGGNILGKKLEFNYNPHCIYVLPDVQNNGIKCYINIVHDVIGGGQIIAAHQQLNTPLGGGPVDIPHYHHIQAHTILSKDPKETRDHMNVVEVFRAIDCKTAYA,aausfp1,164.9,510,504,170000,,,default,4.4,0.97,aausfp1_default,,,,,,,,,,,,,,,,,,,,,b,,,,,,,,,,,C2FJQ
,10.1038/s41586-019-1882-z,LC381432,,Achilles,,,,,MVSKGEELFTGVVPILVELDGDVNGHKFSVRGEGEGDATIGKLTLKLICTTGKLPVPWPTLVTTLGYGLAVFARYPDHMKQHDFFKSAMPEGYVQERTIFFKDDGNYKTRAEVKFEGDTLVNRIELKGSGFKEDGNILGHKLEYNFNSHNVYITADKQKNGIKANFKIRHNIEDGGVQLADHYQQNTPIGDGPVLLPDNHYLSYQSFLSKDPNEKRDHMVLLEFVTAAGITLGMDELYK,achilles,70.4,525,513,110000,,,default,5.5,0.64,achilles_default,,,,,,,,,,,,,,,,,,,,,b,,,,,,,,,,,MLHQR
t,10.1371/journal.pone.0002680,ACD13192,14926073,aeurGFP,,,,,MSYSKQGIVQEMKTKYHMEGSVNGHEFTIEGVATGYPYEGKQMSELVIIKPKGKPLPFSFDILSSVFQYGNRCFTKYPADIPDYFKQAFPDGMSYERSFLFEDGAVATASWNIRLEGNCFIHNSIFHGVNFPADGPVMKKQTIGWDKSFEKMTVSKEVLRGDVTMFLMLEGGGYHRCQFHSTYKTEKPVTLPPNHVVEHQIVRTDLGQSAKGFTVKLEALAAAHVNPLKVQ,aeurgfp,97.62,515,504,145700,,,default,,0.67,aeurgfp_default,,,,,,,,,,,,,,,,,,,,,b,,,,,,,,,,B6CTZ3,4NRYW
t,10.1371/journal.pone.0002680,AAU06857,3620756,afraGFP,,,,,MSVIVKEMMTKLHMEGTVNGHAFTIEGKGKGDPYNGVQSMNLDVKGGAPLPFSFDLLTPAFMYGNRVFTKYPEDIPDFFKQVFPEGYHWERSITFEDQAVCTATSHIRLDQKEMCFIYDVRFHGVNFPANGPIMQKKILGWEPSTEKMYARDGVLKGDVNMTLRVEGGGHYRADFRTTYKAKKPVNLPGYHFIDHRIEITKHSKDYTNVALYEAAVARHSPLPKVA,afragfp,61.49,503,494,100800,,,default,,0.61,afragfp_default,,,,,,,,,,,,,,,,,,,,,b,,,,,,,,,,Q66PU5,T5A9C
t,10.1371/journal.pone.0002680,AAU06847,3620741,anobGFP,,,,,MSYSKQGIAQEMKTKYHMEGSVNGHEFTIEGVGTGYPYEGKQMSELVIIKPAGKPLPFSFDILSSVFQYGNRCFTKYPADMPDYFKQAFPDGMSYERSFLFEDGAVATASWKIRLEGNCFIHNSIFNGVNFPADGPVMEKKTIGWDKSFEKMTVSKEVLRGDVTMFLMLEGGGSHRCQFHSTYKTEKPVTLPPNHVVEHQIVRTDLGQSAKGFTVKLEAHAAAHVNPLKVK,anobgfp,57.72,511,502,96200,,,default,,0.6,anobgfp_default,,,,,,,,,,,,,,,,,,,,,b,,,,,,,,,,Q66PV7,W1X8H
m,10.1101/2020.03.30.015156,LC085679,,AzaleaB5,,,,,MENVRRKTGIQTEMKTKLHMDGMVNGHSFEIKGEGKGSPYEGVQTMKLKVTKGAPLPFSIDILLPQCMYGSKPFIKYPENIPDYLKLSFPEGITWERTMTFEDGAVCDVSNDSRLVGNCFIYTVKFQGVNFPLDGPVMQKKTRGWEPSTEVLYECDGWMRGLVDIALKLENGGHYMCNFKTTYKSKKGLEVPPYHFVDHKLDLLSHNTDGATFEEFEQGEIAHAHLSKLA,azaleab5,60.32,596,574,104000,,,default,,0.58,azaleab5_default,,,,,,,,,,,,,,,,,,,,,b,,,,,,,,,,,886AH
d,10.1038/srep05469,,,bfloGFPa1,,,,,MPLPATHDIHLHGSINGHEFDMVGGGKGDPNAGSLVTTAKSTKGALKFSPYLMIPHLGYGYYQYLPYPDGPSPFQTSMLEGSGYAVYRVFDFEDGGKLTTEFKYSYEGSHIKADMKLMGSGFPDDGPVMTSQIVDQDGCVSKKTYLNNNTIVDSFDWSYNLQNGKRYRARVSSHYIFDKPFSADLMKKQPVFVYRKCHVKASKTEVTLDEREKAFYELA,bflogfpa1,120.9,512,500,120900,,,default,3.0,1.0,bflogfpa1_default,,,,,,,,,,,,,,,,,,,,,b,,,,,,,,,,,6BXQP
t,10.1007/s10126-007-9072-7,ABI58282,6067037,ccalGFP3,,,,,MSLSKQVVKQDMNMTYHMDGCVNGHSFTIEGEGRGNPFKGQQTLKLRVTKGGPLPFAFDILSATFTYGNRCFCDYPEDMPDYFKQSLPEGYSWERTMMYEDGGCGTASAHISLNKTGFVHKSTFHGVNFPANGPVMQRKTVNWEPSTEKITACDGTLKGDVTMFLLLGGGYQQKCQFQTTYRTDKTVKMPPNHIIEHRLVRSEDGDAVQIQEHAVAKYFTV,ccalgfp3,69.12,517,505,144000,,,default,,0.48,ccalgfp3_default,,,,,,,,,,,,,,,,,,,,,b,,,,,,,,,,Q09HR5,UHFSE
t,10.1007/s10126-007-9072-7,AAZ67342,4620339,ccalRFP1,,,,,MSLSKQVLPRDVKMRYHMDGCVNGHQFIIEGEGTGKPYEGKKILELRVTKGGPLPFAFDILSSVFTYGNRCFCEYPEDMPDYFKQSLPEGHSWERTLMFEDGGCGTASAHISLDKNCFVHKSTFHGVNFPANGPVMQKKTLNWEPSSELITAGDGILKGDVTMFLMLEGGHRLKCQFTTSYKAKKAVKMPPNHIIEHRLVRKEVADAVQIQEHAVAKHFIV,ccalrfp1,54.28,598,568,92000,,,default,,0.59,ccalrfp1_default,,,,,,,,,,,,,,,,,,,,,b,,,,,,,,,,Q2VTM9,T44E8
t,10.1007/s10126-007-9072-7,AAZ67343,4620335,ccalYFP1,,,,,MSHSKQVITQEMKMVYHMDGCVNGHSFTIEGEGTGKPYEGNQTLKLRVTKGGPLPFAFDILTATFCYGNRCFCEYPEDMPDYYKQSFPEGYSFERTMMFEDGACCTTSVHLSLTKNCFVHNSTFHGVNFPANGPVMQKKTLNWEPSSEKITPFEGNLKGDVTMFLKLEGGQQHRCQFQTTYKAHKAVKMPPNHIIEHRLVRSQDGDAVQLKEHAVAKCFTA,ccalyfp1,106.5,523,514,142000,,,default,,0.75,ccalyfp1_default,,,,,,,,,,,,,,,,,,,,,b,,,,,,,,,,Q2VTM8,WVV8W
,10.1039/c0pp00023j,ADI71929,20272185,cgreGFP,,,,,MTTLTEGAKLFEKEIPYITELEGDVEGMKFIIKGVGTGDATTGTIKAKYICTTGDLPVPWATILSSLSYGVFCFAKYPRHIADFFKSTQPDGYSQDRIISFDNDGQYDVKAKVTYENGTLYNRVTVKGTGFKSNGNILGMRVLYHSPPHAVYILPDRKNGGMKIEYNKAFDVMGGGHQMARHAQFNKPLGAWEEDYPLYHHLTVWTSFGKDPDDDETDHLNIVEVIKAVDLETYR,cgregfp,54.21,500,485,63030,,,default,,0.86,cgregfp_default,,,,,,,,,,,,,,,,,,,,,b,,,,,,,,,,D7PM06,ENFU4
wd,10.1074/jbc.m102815200,,,Citrine,1HUY,3DPW,,,MVSKGEELFTGVVPILVELDGDVNGHKFSVSGEGEGDATYGKLTLKFICTTGKLPVPWPTLVTTFGYGLMCFARYPDHMKQHDFFKSAMPEGYVQERTIFFKDDGNYKTRAEVKFEGDTLVNRIELKGIDFKEDGNILGHKLEYNYNSHNVYIMADKQKNGIKVNFKIRHNIEDGSVQLADHYQQNTPIGDGPVLLPDNHYLSYQSALSKDPNEKRDHMVLLEFVTAAGITLGMDELYK,citrine,58.52,529,516,77000,3.6,,default,5.7,0.76,citrine_default,,,,,,,,,,,,,,,,,,,,,b,,,,,,,,,,,VR7EN
d,10.1039/c8ib00063h,,,Citrine2,,,,,MVSKGEELFTGVVPILVELDGDVNGHKFSVTGEGEGDATYGKLTLKFICTTGKLPVPWPTLVTTFGYGLTCFARYPDHMKQHDFFKSAMPEGYVQERTIFFKDDGNYKTRAEVKFEGDTLVNRIELKGIDFKEDGNILGHKLEYNHNSHYVYIMADKQKNGIKANFKIRHNIEDGSVQLADHYQQNTPIGDGPVLLPDNHYLSYQSQLSKDPNEERDHTVLLEFVTAAGITLGMGELYK,citrine2,68.6,522,509,98000,3.3,,default,5.9,0.7,citrine2_default,,,,,,,,,,,,,,,,,,,,,b,,,,,,,,,,,ZWH88
wd,10.1038/nmeth.2171,AFR60231,30275454,Clover,5WJ2,,,,MVSKGEELFTGVVPILVELDGDVNGHKFSVRGEGEGDATNGKLTLKFICTTGKLPVPWPTLVTTFGYGVACFSRYPDHMKQHDFFKSAMPEGYVQERTISFKDDGTYKTRAEVKFEGDTLVNRIELKGIDFKEDGNILGHKLEYNFNSHNVYITADKQKNGIKANFKIRHNVEDGSVQLADHYQQNTPIGDGPVLLPDNHYLSHQSALSKDPNEKRDHMVLLEFVTAAGITHGMDELYK,clover,84.36,515,505,111000,3.2,30.0,default,6.2,0.76,clover_default,,,,,,,,,,,,,,,,,,,,,b,,,,,,,,,,,4Z641
t,10.1073/pnas.062552299,AAM10625,4560782,dendFP,,,,,MNLIKEDMRVKVHMEGNVNGHAFVIEGEGKGKPYEGTQTLNLTVKEGAPLPFSYDILTTALHYGNRVFTKYPEDIPDYFKQSFPEGYSWERTMTYEDKGICTIRSDISLEGDCFFQNVRFNGMNFPPNGPVMQKKTLKWEPSTEKLHVRDGLLVGNINMALLLEGGGHYLCDFKTTYKAKKVVQLPDYHFVDHRIEILSNDSDYNKVKLYEHGVARYSPLPSQAW,dendfp,58.5,508,492,90000,,,Green,6.5,0.65,dendfp_green,23.8,575,557,35000,,,Red,5.2,0.68,dendfp_red,,,,,,,,,,,pc,dendfp_green,dendfp_red,405,,,,,,,Q8T6U0,JTXCJ
d,10.1038/nmeth.2413,,,dLanYFP,,,,,MVSKGEEDNMASLPATHELHIFGSFNGVDFDMVGRGTGNPNDGYEELNLKSTKGDLQFSPWILVPQIGYGFHQYLPFPDGMSPFQAAMKDGSGYQVHRTMQFEDGASLTSNYRYTYEGSHIKGEFQVKGTGFPADGPVMTNSLTAADWCVTKMLYPNDKTIISTFDWTYTTGNGKRYQSTARTTYTFAKPMAANILKNQPMFVFRKTELKHSKTELNFKEWQKAFTDVMGMDELYK,dlanyfp,112.5,524,513,125000,3.1,,default,3.9,0.9,dlanyfp_default,,,,,,,,,,,,,,,,,,,,,b,,,,,,,,,,,SKHT2
m,10.1126/science.1102506,BAD72874,3892390,Dronpa,2IE2,2POX,2IOV,2GX0,MSVIKPDMKIKLRMEGAVNGHPFAIEGVGLGKPFEGKQSMDLKVKEGGPLPFAYDILTTVFCYGNRVFAKYPENIVDYFKQSFPEGYSWERSMNYEDGGICNATNDITLDGDCYIYEIRFDGVNFPANGPVMQKRTVKWEPSTEKLYVRDGVLKGDVNMALSLEGGGHYRCDFKTTYKAKKVVQLPDYHFVDHHIEIKSHDKDYSNVNLHEHAEAHSELPRQAK,dronpa,,,,,,,Off,,,dronpa_off,80.75,518,503,95000,3.6,40.0,On,,0.85,dronpa_on,,,,,,,,,,,ps,dronpa_on,dronpa_off,503,dronpa_off,dronpa_on,400,,,,,7P38V
d,10.1111/j.1742-4658.2010.07618.x,,,dVFP,,,,,MNVIKPDMRIKLRMEGAVNGHKFVILGDGNGKPYEGTQTIDVTVKEGGPLPFAYDILTSAFQYGNRVFTKYPDDIADYFKQSFPVGYSWERSMTYEDGGICTVSSDIKMEGNSFIYEIRFHGLNFPSDGPVMQKKTVKWEPSTEKMYVRDGVLKGDVNMALLLEGGGHYRCDFKSTYKAKRAVQLPDYHYIDHRIEILSHDKDYNKVKLCENAAARCSMLPSQAK,dvfp,107.0,503,491,107000,,,default,,1.0,dvfp_default,,,,,,,,,,,,,,,,,,,,,b,,,,,,,,,,,2DB3H
t,10.1371/journal.pone.0002680,ABB17956,4901576,eechGFP1,,,,,MSVINPDMKIKLYMEGAVNGHKFEIKGEGNGKPFEGKQTMDLAVVDGGPLPFAFDILTTSFNYGNRVFTKYPDTIVDYFKPSFPEGYSWERSMTYEDGGICIATNDITLLKDTDDSNYFYYKIRFDGVNFAANGPVMQKKTAKWEPSTEKMYVRDGVLKGEVNMALLLEGGGHYRCDFKTTYKAKKVVRLPSYHFVDHRIEILSHSKDYNQVRLHEHAEAHSGLPRQAK,eechgfp1,93.15,510,497,124200,,,default,,0.75,eechgfp1_default,,,,,,,,,,,,,,,,,,,,,b,,,,,,,,,,A8CLQ1,MX4SD
t,10.1371/journal.pone.0002680,ABB17968,4901521,eechGFP2,,,,,MNVIKPDMKIKLRMEGAVNGHKFAIEGEGNGQPFEGKQTMNLKVKEGGPLPFAYDILTTIFNYGNRVFVKYPDDIVDYFKQSFPEGYSWERSMIYEDGGICIATNDITLEGDCFVYKIRFDGVNFPAKSPVLQKMTKKWEPSTEKLYVRDGVLKGDVNMALLLEGGGHFRCDFKTTYKAKKVVQLPDYHFVDHRIEIMSHDKDYNNVKLCEHAEAHSGLPGQAK,eechgfp2,75.76,520,506,109800,,,default,,0.69,eechgfp2_default,,,,,,,,,,,,,,,,,,,,,b,,,,,,,,,,A8CLW1,37XMD
t,10.1371/journal.pone.0002680,ABB17969,4901511,eechGFP3,,,,,MNVIKPDMKIRLRMEGAVNGHKFVIIGKGDGKPYEGTQTMDLEVIEGGPLPFAFDILTTVFKYGNRAFVKYPTDIADYFKQSFPEGFSWERSMTYEDGGICIATNDITLSKDIANCFDYNIRFDGVNFPPNSPVLQKTTIKWEPSTENMYVRDGVLKGDINMSLLLEGGAGHYRCDFKTTYKAKKAVKLPDYHFVDHRITIVSHDKDYNKVKLREHAEAHSGLQMEAK,eechgfp3,54.27,524,512,120600,,,default,,0.45,eechgfp3_default,,,,,,,,,,,,,,,,,,,,,b,,,,,,,,,,A8CLW4,31NFQ
t,10.1371/journal.pone.0002680,ABB17958,4901483,efasGFP,,,,,MALSKQGIQTDMKMTYSMEGCVNGHNFTVKGGGDGNPYEGHQELRLCITMAKGEPVPFAFDILSAAFCYGNRCFTKYPDEIRDYFKQAFPGGLSWERSMAFEDGASAAVTAEISLEGDCFEHECEFVGVNFPANGPVMQKKTQGWETSTEKMTAHGKVVQGNVPMFLKLEGGGRHRCDFRTTYKAKKDVKMPNSHFITHCLVRKGDGNNTELIEDAEARN,efasgfp,100.64,507,496,125800,,,default,,0.8,efasgfp_default,,,,,,,,,,,,,,,,,,,,,b,,,,,,,,,,A8CLR1,5EU5J
m,10.1038/s41598-022-13214-0,OL631607,,Electra2,,,,,MVSKGEELIEENMRMKVVMEGSVNGHQFKCTGEGEGRPYEGVQTMRIKVIEGGPLPFAFDILATSFLFGSKTFIKYPADIPDFFEQSFPEGFTWERVTRYEDGGVVTVTQDTSLEDGGLVYNVKVRGVNFHSKGPVMQKKTEGWEPFTEMMYPADGGLRGYTDIALKVDGGGHLHANIVTTYRSKKTVGNIKMPGVHAVDYRLERIEESDNETYVVLREVAVAKYSNLGGGMDELFK,electra2,61.48,454,403,80900,3.4,,default,,0.76,electra2_default,,,,,,,,,,,,,,,,,,,,,b,,,,,,,,,,,5GJX3
d,10.1038/nmeth1062,,,eqFP578,,,,,MSELIKENMHMKLYMEGTVNNHHFKCTSEGERKPYEGTQTMKIKVVEGGPLPFAFDILATSFMYGSKTFINHTQGIPDLFKQSFPEGFTWERITTYEDGGVLTATQDTSLQNGCIIYNVKINGVNFPSNGSVMQKKTLGWEANTEMLYPADGGLRGHSQMALKLVGGGYLHCSFKTTYRSKKPAKNLKMPGFHFVDHRLERIKEADKETYVEQHEMAVAKYCDLPSKLGHR,eqfp578,55.08,578,552,102000,,,default,,0.54,eqfp578_default,,,,,,,,,,,,,,,,,,,,,b,,,,,,,,,,H3JQU7,G5OWS
wd,10.1073/pnas.96.5.2135,,,EYFP-Q69K,,,,,MVSKGEELFTGVVPILVELDGDVNGHKFSVSGEGEGDATYGKLTLKFICTTGKLPVPWPTLVTTFGYGLKCFARYPDHMKQHDFFKSAMPEGYVQERTIFFKDDGNYKTRAEVKFEGDTLVNRIELKGIDFKEDGNILGHKLEYNYNSHNVYIMADKQKNGIKVNFKIRHNIEDGSVQLADHYQQNTPIGDGPVLLPDNHYLSYQSALSKDPNEKRDHMVLLEFVTAAGITLGMDELYK,eyfp-q69k,54.72,526,514,72000,,,default,5.8,0.76,eyfp-q69k_default,,,,,,,,,,,,,,,,,,,,,b,,,,,,,,,,,XZJ98
d,10.1371/journal.pone.0181186,BBA07588.1,BBA07588.1,eYGFP,,,,,MTTFKIESRIHGNLNGEKFELVGGGVGEEGRLEIEMKTKDKPLAFSPFLLSHCMGYGFYHFASFPKGTKNIYLHAATNGGYTNTRKEIYEDGGILEVNFRYTYEFNKIIGDVECIGHGFPSQSPIFKDTIVKTCPTVDLMLPMSGNIIASSYAKAFQLKDGSFYTAEVKNNIDFKNPIHESFSKSGPMFTHRRVEETHTKENLAMVEYQQVFNSAPRDM,eygfp,71.92,516,507,124000,,,Default,3.81,0.58,eygfp_default,,,,,,,,,,,,,,,,,,,,,b,,,,,,,,,,,MQNBX
t,10.1371/journal.pone.0002680,ACD13193,14926074,fabdGFP,,,,,MSVIKPDMKIKLRMEGAVNGHKFAIEGEGKGQPFQGKQTMNLKVKEGGPLPFAYDILTTIFNYGNRVFAKYPDDIVDYFKQSFPEGYSWERSMTYEDGGICIATNDITLDGDCFVYKIRFDGVNFPAKSPVLQKKTQKWEPSTEKLYVRDGLLKGDVNMALLLEGGGHYRCDFKTTYKAKKVVQLPDYHFVDHCIEIVSHDKDYNNVKLCEHAEAHSGLPKEAK,fabdgfp,63.07,520,508,116800,,,default,,0.54,fabdgfp_default,,,,,,,,,,,,,,,,,,,,,b,,,,,,,,,,B6CTZ4,BQFPM
m,10.1021/nn4060144,,,ffDronpa,,,,,MSVIKPDMKIKLRMEGAVNGHPFAIEGVGLGKPFEGKQSMDLKVKEGGPLPFAYDILTTAFCYGNRVFAKYPENIVDYFKQSFPEGYSWERSMNYEDGGICNATNDITLDGDCYIYEIRFDGVNFPANGPVMQKRTVKWEPSTEKLYVRDGVLKGDVNMALSLEGGGHYRCDFKTTYKAKKVVQLPDYHFVDHHIEIKSHDKDYSNVNLHEHAEAHSELPRQAK,ffdronpa,,,,,,,Off,,,ffdronpa_off,78.75,517,503,105000,,15.0,On,5.0,0.75,ffdronpa_on,,,,,,,,,,,ps,ffdronpa_on,ffdronpa_off,488,ffdronpa_off,ffdronpa_on,405,,,,,9U6KU
wd,10.1038/s41592-022-01660-7,,,FOLD6,7UGT,,,,MVSKGEELFTGVVPILVELDGDVNGHKFSVRGEGEGDATNGKLTLKFISTTGKLPVPWPTLVTTLGYGLAVFARYPDHMKQHDFFKSAMPEGYVQERTISFEDDGYYKTRAEVKFEGDTLVNRIVLKGIDFKEDGNILGHKLEYNFNPHNVYITADKQKNGIKANFKTRHNVEDGGVQLADHYQQNTPIGDGPVLLPDNHYLSHQSVLSKDPNEKRDHMVLLEFVTAAGITHDMNELYK,fold6,86.29,515,505,118200,,25.0,default,5.9,0.73,fold6_default,,,,,,,,,,,,,,,,,,,,,b,,,,,,,,,,,C5EUY
d,10.1038/10904,,,Folding Reporter GFP,2B3Q,,,,MSKGEELFTGVVPILVELDGDVNGHKFSVSGEGEGDATYGKLTLKFICTTGKLPVPWPTLVTTLTYGVQCFSRYPDHMKRHDFFKSAMPEGYVQERTISFKDDGNYKTRAEVKFEGDTLVNRIELKGIDFKEDGNILGHKLEYNYNSHNVYITADKQKNGIKANFKIRHNIEDGSVQLADHYQQNTPIGDGPVLLPDNHYLSTQSALSKDPNEKRDHMVLLEFVTAAGITHGMDELYK,folding-reporter-gfp,59.33,530,490,82400,,,default,,0.72,folding-reporter-gfp_default,,,,,,,,,,,,,,,,,,,,,b,,,,,,,,,,,N6ZHS
m,10.1021/acs.biochem.0c00484,,,FusionRed-MQV,,,,,MVSELIKENMPMKLYMEGTVNNHHFKCTSEGEGKPYEGTQTQRIKVVEGGPLPFAFDILATSFMYGSRTFIKHPPGIPDFFKQSFPEGFTWERVTTYEDGGVLTATQDTSLQDGCLIYNVKVRGVNFPANGPVMQKKTLGWEASTETMYPADGGLEGAVDMALKLVGGGHLICNMETTYRSKKPATNLKMPGVYNVDHRLERIKEADDETYVEQHEVAVARYSTGGAGDGGK,fusionred-mqv,76.32,585,566,144000,2.77,195.0,default,4.6,0.53,fusionred-mqv_default,,,,,,,,,,,,,,,,,,,,,b,,,,,,,,,,,F35B7
m,10.1016/j.chembiol.2017.12.005,BBC28144,174808012,Gamillus,5Y01,5Y00,,,MVSKGEEASGRALFQYPMTSKIELNGEINGKKFKVAGEGFTPSSGRFNMHAYCTTGDLPMSWVVIASPLQYGFHMFAHYPEDITHFFQECFPGSYTLDRTLRMEGDGTLTTHHEYSLEDGCVTSKTTLNASGFDPKGATMTKSFVKQLPNEVKITPHGPNGIRLTSTVLYLKEDGTIQIGTQDCIVTPVGGRKVTQPKAHFLHTQIIQKKDPNDTRDHIVQTELAVAGNLWHGMDELYK,gamillus,74.7,519,504,83000,,8.0,On,3.4,0.9,gamillus_on,,,,,,,Off,,,gamillus_off,,,,,,,,,,,ps,gamillus_on,gamillus_off,488,gamillus_off,gamillus_on,388,,,,,21PQ5
m,10.1016/j.chembiol.2017.12.005,,,Gamillus0.4,,,,,MASGRALFQYPMTSKIELNGEINGKKFKVAGEGFTPSSGRFNMHAYCTTGDLPMSWVVIASPLQYGFHMFAHYPEDITHFFQECFPGSYTLDRTLRMEGDGTLTTHHEYSLEDGCVTSKTTLNASGFDPKGATMTKSFVEQLPNQVKITAEGNGIRLTSTVLYLKKDGTIQIGTQDCIVKPVGGRKVTQPKAHFLHTQIIQKKDPNDTRDHIVQTELAVAGNLWHEPSASAV,gamillus04,66.75,524,505,75000,,,default,4.0,0.89,gamillus04_default,,,,,,,,,,,,,,,,,,,,,b,,,,,,,,,,,JVUSZ
t,10.1371/journal.pone.0002680,ABB17962,4901546,gfasGFP,,,,,MNVIKPDMKIKLCMRGTINGHNFVIEGEGKGNPYEGTQILDLNVTEGAPLPFAYDILTTVFQYGNRAFTKYPADIQDYFKQTFPEGYHWERSMTYEDQGICTATSNISMRGDCFFYDIRFDGVNFPPNGPVMQKKTLKWEPSTEKMYVRDGVLKGDVNMALLLEGGGHYRCDFKTTYKAKKDVRLPDYHFVDHRIEILKHDKDYNKVELYENAVARYSMLPSQAK,gfasgfp,74.83,506,492,102500,,,default,,0.73,gfasgfp_default,,,,,,,,,,,,,,,,,,,,,b,,,,,,,,,,A8CLT2,ASMG7
td,10.1002/cbic.201600492,,,GRvT,,,,,MVSKGEEVIKEFMRFKVRMEGSMNGHEFEIEGEGEGRPYEGTQTAKLKVTKGGPLPFAWDILSPLLMYGSKMYVKHPADIPDYKKLSFPEGFKWVRVMNFEDGGLVTATQDSSLQDGTLIYEVKMRGTNFPPDGPVMQKKTMGWEASTERLYPRDGVLKGEIHQALKLKDGGHYLVEFKTIYMAKKPVQLPGYYYVDTKLDITSHNEDYTRVEQYERSEGRHHLFLYDGSTGSGSSGTMVSKGEEVIKEFMRFKVRMEGSMNGHEFEIEGEGEGRPYEGTQTAKLKVTKGGPLPFAWDILSPQFMYGSKAYVKHPADIPDYKKLSFPEGFKWERVMNFEDGGLVTVTQDSSIQDGTLIYKVKMRGTNFPPDGPVMQKKTMGWEASTERLYPRDGVLKGEIHQALKLKDGGHYLVEFKTIYMAKKPVQLPGYYYVDTKLDITSHNEDYTIVEQYERSEGRHHLFLYGMDELYK,grvt,68.87,583,557,71000,,,Red excitation,2.5,0.97,grvt_red-excitation,36.49,583,477,89000,,,FRET excitation,3.3,0.41,grvt_fret-excitation,,,,,,,,,,,b,,,,,,,,,,,H93B4
d,10.1101/2020.03.30.015156,BBC08820,,h2-3,,,,,MSKLQKGVEKEMKIKLTMNCTVNERNFVITGQGAGEPYDGTQTLYLTVEGGKTLNFSFDVLTPAFQYGNRAFTKYPGNIPDFFKQTFSGGGYTWKRTMTYEDGGVSTVESDISVQGDCFHYKIQFNGKFPPHGPVMQKETVKWEPSTEVMYKDDKNDGVLKGDVNMALLLKDGGHLRVDFNTSYIPKNKVEKMPDYHFVDHRIEILEKPEGRPVKLYAGAVARYSLLPEKNLNK,h2-3,115.7,516,506,130000,,,default,4.6,0.89,h2-3_default,,,,,,,,,,,,,,,,,,,,,b,,,,,,,,,,,YQ25V
wd,10.1038/s41592-022-01660-7,OP373686,,Hyperfolder YFP,7UGR,,,,MVSKGEELFTGVVPILVELDGDVNGHKFSVRGEGEGDATNGKLTLKLISTTGKLPVPWPTLVTTLGYGLMVFARYPDHMKQHDFFKSAMPEGYVQERTISFEDDGYYKTRAEVKFEGDTLVNRIVLKGIDFKEDGNILGHKLEYNFNSHNVYITADKQKNGIKANFKIRHNVEDGGVQLADHYQQNTPIGDGPVLLPDNHYLSYQSVLSKDPNEKRDHMVLKERVTAAGITHDMNELYK,hyperfolder-yfp,71.7,529,514,119500,,21.0,default,5.6,0.6,hyperfolder-yfp_default,,,,,,,,,,,,,,,,,,,,,b,,,,,,,,,,,YX459
m,10.1371/journal.pone.0095808,,,iq-mVenus,,,,,,iq-mvenus,55.88,529,516,88700,,,default,,0.63,iq-mvenus_default,,,,,,,,,,,,,,,,,,,,,b,,,,,,,,,,,H9KU1
t,10.1073/pnas.202320599,BAC20344,,Kaede,,,,,MSLIKPEMKIKLLMEGNVNGHQFVIEGDGKGHPFEGKQSMDLVVKEGAPLPFAYDILTTAFHYGNRVFAKYPDHIPDYFKQSFPKGFSWERSLMFEDGGVCIATNDITLKGDTFFNKVRFDGVNFPPNGPVMQKKTLKWEASTEKMYLRDGVLTGDITMALLLKGDVHYRCDFRTTYKSRQEGVKLPGYHFVDHCISILRHDKDYNEVKLYEHAVAHSGLPDNVK,kaede,19.93,580,572,60400,4.2,,Red,5.6,0.33,kaede_red,86.94,518,508,98800,3.4,,Green,5.6,0.88,kaede_green,,,,,,,,,,,pc,kaede_green,kaede_red,380,,,,,,,,Q31FH
t,10.1038/sj.embor.7400361,,,KikG,1XSS,,,,MSVITSEMKMELRMEGAVNGHKFVITGKGSGQPFEGIQNMDLTVIEGGPLPFAFDILTTVFDYGNRVFVKYPEEIVDYFKQSFPEGYSWERSMSYEDGGICLATNNITMKKDGSNCFVYEIRFDGVNFPANGPVMQRKTVKWEPSTEKMYVRDGVLKGDVNMALLLQGGGHYRCDFRTTYKAKKVVQLPDYHFVDHRIEITSHDKDYNKVKLYEHAKAHSGLPRLAK,kikg,55.08,517,507,81000,,,default,4.2,0.68,kikg_default,,,,,,,,,,,,,,,,,,,,,b,,,,,,,,,,,PRMX6
t,10.1038/nmeth.2413,ACA48232,14640227,LanYFP,5LTQ,,,,MSLPATHELHIFGSFNGVDFDMVGRGTGNPNDGYEELNLKSTKGALQFSPWILVPQIGYGFHQYLPFPDGMSPFQAAMKDGSGYQVHRTMQFEDGASLTSNYRYTYEGSHIKGEFQVIGTGFPADGPVMTNSLTAADWCVTKMLYPNDKTIISTFDWTYTTGSGKRYQSTVRTNYTFAKPMAANILKNQPMFVFRKTELKHSKTELNFKEWQKAFTDVM,lanyfp,142.5,524,513,150000,,,default,3.5,0.95,lanyfp_default,,,,,,,,,,,,,,,,,,,,,b,,,,,,,,,,B1PNC0,WK5F6
m,10.1038/s41592-024-02203-y,,,mBaoJin,8QBJ,8Q79,8QDD,,MVSKGEEENMASTPFKFQLKGTINGKSFTVEGEGEGNSHEGSHKGKYVCTSGKLPMSWAALGTTFGYGMKYYTKYPSGLKNWFREVMPGGFTYDRHIQYKGDGSIHAKHQHFMKNGTYHNIVEFTGQDFKENSPVLTGDMNVSLPNEVPQIPRDDGVECPVTLLYPLLSDKSKYVEAHQYTICKPLHNQPAPDVPYHWIRKQYTQSKDDAEERDHICQSETLEAHLKGMDELYK,mbaojin,119.04,508,500,128000,3.1,7.6,default,4.37,0.93,mbaojin_default,,,,,,,,,,,,,,,,,,,,,b,,,,,,,,,,,4XHVQ
m,10.21203/rs.3.rs-3188559/v1,,,mBaoJin-S134P,,,,,,mbaojin-s134p,58.3,510,502,70245,,,default,,0.83,mbaojin-s134p_default,,,,,,,,,,,,,,,,,,,,,b,,,,,,,,,,,YM2UC
m,10.21203/rs.3.rs-3188559/v1,,,mBaoJin-T55S,,,,,MVSKGEEENMASTPFKFQLKGTINGKSFTVEGEGEGNSHEGSHKGKYVCTSGKLPMSWAALGTSFGYGMKYYTKYPSGLKNWFREVMPGGFTYDRHIQYKGDGSIHAKHQHFMKNGTYHNIVEFTGQDFKENSPVLTGDMNVSLPNEVPQIPRDDGVECPVTLLYPLLSDKSKYVEAHQYTICKPLHNQPAPDVPYHWIRKQYTQSKDDAEERDHICQSETLEAHLKGMDELYK,mbaojin-t55s,109.22,508,497,127000,,,default,,0.86,mbaojin-t55s_default,,,,,,,,,,,,,,,,,,,,,b,,,,,,,,,,,KEBCT
m,10.21203/rs.3.rs-3188559/v1,,,mBaoJin-V152E,,,,,,mbaojin-v152e,69.63,508,498,114146,,,default,,0.61,mbaojin-v152e_default,,,,,,,,,,,,,,,,,,,,,b,,,,,,,,,,,K655P
m,10.1126/science.1068539,,,mCitrine,,,,,MVSKGEELFTGVVPILVELDGDVNGHKFSVSGEGEGDATYGKLTLKFICTTGKLPVPWPTLVTTFGYGLMCFARYPDHMKQHDFFKSAMPEGYVQERTIFFKDDGNYKTRAEVKFEGDTLVNRIELKGIDFKEDGNILGHKLEYNYNSHNVYIMADKQKNGIKVNFKIRHNIEDGSVQLADHYQQNTPIGDGPVLLPDNHYLSYQSKLSKDPNEKRDHMVLLEFVTAAGITLGMDELYK,mcitrine,69.56,529,516,94000,,,default,,0.74,mcitrine_default,,,,,,,,,,,,,,,,,,,,,b,,,,,,,,,,,3Q37R
m,10.1038/srep20889,,,mClover3,,,,,MVSKGEELFTGVVPILVELDGDVNGHKFSVRGEGEGDATNGKLTLKFICTTGKLPVPWPTLVTTFGYGVACFSRYPDHMKQHDFFKSAMPEGYVQERTISFKDDGTYKTRAEVKFEGDTLVNRIELKGIDFKEDGNILGHKLEYNFNSHYVYITADKQKNCIKANFKIRHNVEDGSVQLADHYQQNTPIGDGPVLLPDNHYLSHQSKLSKDPNEKRDHMVLLEFVTAAGITHGMDELYK,mclover3,85.02,518,506,109000,3.11,43.5,default,6.5,0.78,mclover3_default,,,,,,,,,,,,,,,,,,,,,b,,,,,,,,,,,RYFE4
t,10.1371/journal.pone.0002680,ABB17952,4901499,meffRFP,,,,,MALSKNGLTKNMTTKYRMEGCVDGHKFVITGDGIGDPFEGKQTSIDLCVVEGGPLPFSEDILSAVFDYGNRVFTKYPQDLVDYFKNSCPAGYTWQRSFLFEDGAVCTASADITVSVEENCFYHESKFHGVNFPADGPVMKKMTTNWEPSCEKITPIPNEGILKGDVTMFLLLKDGGRYRCQFDTVYKAKSDPKTIMMPDWHFIQHKLNREDRSDAKHQKWRLVENAIAYRSTLS,meffrfp,55.78,576,560,99600,,,default,,0.56,meffrfp_default,,,,,,,,,,,,,,,,,,,,,b,,,,,,,,,,A8CLN4,ND36H
m,10.1038/nmeth.2021,,,mEos3.1,,,,,MSAIKPDMKIKLRMEGNVNGHHFVIDGDGTGKPFEGKQSMDLEVKEGGPLPFAFDILTTAFHYGNRVFAKYPDNIQDYFKQSFPKGYSWERSLTFEDGGICNARNDITMEGDTFYNKVRFYGTNFPANGPVMQKKTLKWEPSTEKMYVRDGVLTGDVEMALLLEGNAHYRCDFRTTYKAKEKGVKLPGAHFVDHCIEILSHDKDYNKVKLYEHAVAHSGLPDNARR,meos31,73.37,513,505,88400,,,Green,5.2,0.83,meos31_green,20.77,580,570,33500,,,Red,6.0,0.62,meos31_red,,,,,,,,,,,pc,meos31_green,meos31_red,405,,,,,,,,73GT1
m,10.1038/s41592-019-0613-6,,,mEosEM,,,,,MVSAIKPDMRIKLRMEGNVNGHHFVIDGEGTGKPYEGKQTMDLEVKEGGPLPFAFDILTTAFHYGNRVFVKYPDNIQDYFKQSFPKGYSWERSMTFEDGGICNARNDITMEGDTFYNKVRFYGTNFPANGPVMQKKTLKWEPSTEKMYVRDGVLTGDIEMALLLEGGAHYRCDFRTTYKAKEKGVKLPGAHFVDHAIEILSHDKDYNKVKLYEHAVAHSGLPDNARR,meosem,122.96,511,503,155650,,,Green,6.0,0.79,meosem_green,112.28,579,569,170128,,,Red,6.5,0.66,meosem_red,,,,,,,,,,,pc,meosem_green,meosem_red,405,,,,,,,,DKEXK
m,10.1073/pnas.1113770109,,,mGeos-C,,,,,MSAIKPDMKIKLRMEGNVNGHHFVIDGDGTGKPFEGKQSMDLEVKEGGPLPFAFDILTTAFCYGNRVFAKYPDNIQDYFKQSFPKGYSWERSLTFEDGGICIARNDITMEGDTFYNKVRFYGTNFPANGPVMQKKTLKWEPSTEKMYVRDGVLTGDIHMALLLEGNAHYRCDFRTTYKAKEKGVKLPGYHFVDHCIEILSHDKDYNKVKLYEHAVAHSGLPDNARR,mgeos-c,62.34,516,505,76967,,,On,6.0,0.81,mgeos-c_on,,,,,,,Off,,,mgeos-c_off,,,,,,,,,,,ps,mgeos-c_off,mgeos-c_on,405,mgeos-c_on,mgeos-c_off,488,,,,,VVNZ5
m,10.1126/sciadv.abb7438,,,mGold,,,,,MVSKGEELFTGVVPILVELDGDVNGHKFSVSGEGEGDATYGKLTLKFICTTGKLPVPWPTLVTSLGYGLQCFARYPDHMKQHDFFKSAMPEGYVQERTIFFKDDGNYKTRAEVKFEGDTLVNRIELKGIDFKEDGNILGHKLEYNYNSHNVYITADKQKNGIKANFKIRHNIEDGGVQLADHYQQNTPIGDGPVLLPDNHYLSYQSKLSKDPNEKRDHMVLLEFVTAAGITLGMDELYK,mgold,68.48,531,515,107000,,,default,5.9,0.64,mgold_default,,,,,,,,,,,,,,,,,,,,,b,,,,,,,,,,,UNETX
m,10.1073/pnas.2000942117,,,mGreenLantern,,,,,MVSKGEELFTGVVPILVELDGDVNGHKFSVRGEGEGDATNGKLTLKFICTTGKLPVPWPTLVTTLGYGVACFARYPDHMKQHDFFKSAMPEGYVQERTISFKDDGTYKTRAEVKFEGDTLVNRIVLKGIDFKEDGNILGHKLEYNFNSHKVYITADKQKNGIKANFKTRHNVEDGGVQLADHYQQNTPIGDGPVLLPDNHYLSHQSKLSKDPNEKRDHMVLKERVTAAGITHDMDELYK,mgreenlantern,73.3,514,503,101800,,13.5,default,5.6,0.72,mgreenlantern_default,,,,,,,,,,,,,,,,,,,,,b,,,,,,,,,,,G1VL1
m,10.1038/nmeth.1235,,,mKO&kappa;,,,,,MVSVIKPEMKMRYYMDGSVNGHEFTIEGEGTGRPYEGHQEMTLRVTMAEGGPMPFAFDLVSHVFCYGHRVFTKYPEEIPDYFKQAFPEGLSWERSLEFEDGGSASVSAHISLRGNTFYHKSKFTGVNFPADGPIMQNQSVDWEPSTEKITASDGVLKGDVTMYLKLEGGGNHKCQFKTTYKAAKEILEMPGDHYIGHRLVRKTEGNITEQVEDAVAHS,mkokappa,64.05,563,551,105000,,,default,4.2,0.61,mkokappa_default,,,,,,,,,,,,,,,,,,,,,b,,,,,,,,,,,HMK8R
m,10.1038/nmeth.2413,AGG56535,34051755,mNeonGreen,5LTP,5LTR,,,MVSKGEEDNMASLPATHELHIFGSINGVDFDMVGQGTGNPNDGYEELNLKSTKGDLQFSPWILVPHIGYGFHQYLPYPDGMSPFQAAMVDGSGYQVHRTMQFEDGASLTVNYRYTYEGSHIKGEAQVKGTGFPADGPVMTNSLTAADWCRSKKTYPNDKTIISTFKWSYTTGNGKRYRSTARTTYTFAKPMAANYLKNQPMYVFRKTELKHSKTELNFKEWQKAFTDVMGMDELYK,mneongreen,92.8,517,506,116000,3.1,10.0,default,5.7,0.8,mneongreen_default,,,,,,,,,,,,,,,,,,,,,b,,,,,,,,,,,ZRKRV
m,10.1038/s41592-022-01660-7,OP373687,,Monomeric hyperfolder YFP,7UGS,,,,MVSKGEELFTGVVPILVELDGDVNGHKFSVRGEGEGDATNGKLTLKLISTTGKLPVPWPTLVTTLGYGLMVFARYPDHMKQHDFFKSAMPEGYVQERTISFEDDGYYKTRAEVKFEGDTLVNRIVLKGIDFKEDGNILGHKLEYNFNPHNVYITADKQKNGIKANFKIRHNVEDGGVQLADHYQQNTPIGDGPVLMPDNHYLSYQSKLSKDPNEKRDHMVLKERVTAAGITHDMNELYK,monomeric-hyperfolder-yfp,76.88,529,515,124000,,27.0,default,5.7,0.62,monomeric-hyperfolder-yfp_default,,,,,,,,,,,,,,,,,,,,,b,,,,,,,,,,,PF2S1
m,10.1038/ncomms8670,,,moxNeonGreen,,,,,MVSKGEEDNMASLPATHELHIFGSINGVDFDMVGQGTGNPNDGYEELNLKSTKGDLQFSPWILVPHIGYGFHQYLPYPDGMSPFQAAMVDGSGYQVHRTMQFEDGASLTVNYRYTYEGSHIKGEAQVKGTGFPADGPVMTNSLTAADWSRSKKTYPNDKTIISTFKWSYTTGNGKRYRSTARTTYTFAKPMAANYLKNQPMYVFRKTELKHSKTELNFKEWQKAFTDVMGMDELYK,moxneongreen,82.14,520,505,111000,,,default,,0.74,moxneongreen_default,,,,,,,,,,,,,,,,,,,,,b,,,,,,,,,,,GSCT9
m,10.1038/srep20889,ATE88097,,mRuby3,,,,,MVSKGEELIKENMRMKVVMEGSVNGHQFKCTGEGEGRPYEGVQTMRIKVIEGGPLPFAFDILATSFMYGSRTFIKYPADIPDFFKQSFPEGFTWERVTRYEDGGVVTVTQDTSLEDGELVYNVKVRGVNFPSNGPVMQKKTKGWEPNTEMMYPADGGLRGYTDIALKVDGGGHLHCNFVTTYRSKKTVGNIKMPGVHAVDHRLERIEESDNETYVVQREVAVAKYSNLGGGMDELYK,mruby3,57.6,592,558,128000,,136.5,default,4.8,0.45,mruby3_default,,,,,,,,,,,,,,,,,,,,,b,,,,,,,,,,,MZMFB