agg,doi,genbank,ipg_id,name,pdb,pdb.0,pdb.1,pdb.10,pdb.2,pdb.3,pdb.4,pdb.5,pdb.6,pdb.7,pdb.8,pdb.9,seq,slug,states.0.brightness,states.0.em_max,states.0.ex_max,states.0.ext_coeff,states.0.lifetime,states.0.maturation,states.0.name,states.0.pka,states.0.qy,states.0.slug,states.1.brightness,states.1.em_max,states.1.ex_max,states.1.ext_coeff,states.1.lifetime,states.1.maturation,states.1.name,states.1.pka,states.1.qy,states.1.slug,states.2.brightness,states.2.em_max,states.2.ex_max,states.2.ext_coeff,states.2.lifetime,states.2.maturation,states.2.name,states.2.pka,states.2.qy,states.2.slug,states.3.brightness,states.3.em_max,states.3.ex_max,states.3.ext_coeff,states.3.lifetime,states.3.maturation,states.3.name,states.3.pka,states.3.qy,states.3.slug,states.4.brightness,states.4.em_max,states.4.ex_max,states.4.ext_coeff,states.4.lifetime,states.4.maturation,states.4.name,states.4.pka,states.4.qy,states.4.slug,states.5.brightness,states.5.em_max,states.5.ex_max,states.5.ext_coeff,states.5.lifetime,states.5.maturation,states.5.name,states.5.pka,states.5.qy,states.5.slug,states.6.brightness,states.6.em_max,states.6.ex_max,states.6.ext_coeff,states.6.lifetime,states.6.maturation,states.6.name,states.6.pka,states.6.qy,states.6.slug,states.7.brightness,states.7.em_max,states.7.ex_max,states.7.ext_coeff,states.7.lifetime,states.7.maturation,states.7.name,states.7.pka,states.7.qy,states.7.slug,switch_type,transitions.0.from_state,transitions.0.to_state,transitions.0.trans_wave,transitions.1.from_state,transitions.1.to_state,transitions.1.trans_wave,transitions.2.from_state,transitions.2.to_state,transitions.2.trans_wave,transitions.3.from_state,transitions.3.to_state,transitions.3.trans_wave,transitions.4.from_state,transitions.4.to_state,transitions.4.trans_wave,uniprot,uuid
,10.1126/science.273.5280.1392,,,10B,,,,,,,,,,,,,MSKGEELFTGVVPILVELDGDVNGHKFSVSGEGEGDATYGKLTLKFICTTGKLPVPWPTLVTTLGYGVQCFARYPDHMKQHDFFKSAMPEGYVQERTIFFKDDGNYKTRAEVKFEGDTLVNRIELKGIDFKEDGNILGHKLEYNYNSHNVYIMADKQKNGIKVNFKIRHNIEDGSVQLADHYQQNTPIGDGPVLLPDNHYLSYQSALSKDPNEKRDHMVLLEFVTAAGITHGMDELYK,10b,,525,513,30800,,,default,,,10b_default,,,,,,,,,,,,,,,,,,,,,,,,,,,,,,,,,,,,,,,,,,,,,,,,,,,,,,,,,,,,,,,,,,,,,,,,,,,,,,,,,,,,,,,,RO9XQ
,10.1126/science.273.5280.1392,,,11,,,,,,,,,,,,,MSKGEELFTGVVPILVELDGDVNGHKFSVSGEGEGDATYGKLTLKFICTTGKLPVPWPTLVTTFGYGVQCFARYPDHMKQHDFFKSAMPEGYVQERTIFFKDDGNYKTRAEVKFEGDTLVNRIELKGIDFKEDGNILGHKLEYNYNSHNVYIMADKQKNGIKVNFKIRHNIEDGSVQLADHYQQNTPIGDGPVLLPDNHYLSWQSALSKDPNEKRDHMVLLEFVTAAGITHGMDELYK,11,,512,502,33000,,,default,,,11_default,,,,,,,,,,,,,,,,,,,,,,,,,,,,,,,,,,,,,,,,,,,,,,,,,,,,,,,,,,,,,,,,,,,,,,,b,,,,,,,,,,,,,,,,,W92N1
t,10.1126/science.1102506,,,22G,,2Z6X,,,,,,,,,,,MSVIKPDMKIKLRMEGAVNGHPFAIEGVGLGKPFEGKQSMDLKVKEGGPLPFAYDILTTVFCYGNRVFAKYPENIVDYFKQSFPEGYSWERSMNYEDGGICIATNDITLDGDCFIYEIRFDGVNFPANGPVMQKRTVKWEPSTEKLYVRDGVLKGDVNMALLLEGGGHYRCDFKTTYKAKKVVQLPDYHFVDHRIEIKSHDKDYNNVNLHEHAEAHSGLPRQAK,22g,,,,,,,,,,,,,,,,,,,,,,,,,,,,,,,,,,,,,,,,,,,,,,,,,,,,,,,,,,,,,,,,,,,,,,,,,,,,,,,,,,,,,,,,,,,,,,,,,,1UZQ4
,10.1002/cbic.200300818,,,(3-F)Tyr-EGFP,,1RRX,,,,,,,,,,,SKGEELFTGVVPILVELDGDVNGHKFSVSGEGEGDATYGKLTLKFICTTGKLPVPWPTLVTTLGYGVQCFSRYPDHMKQHDFFKSAMPEGYVQERTIFFKDDGNYKTRAEVKFEGDTLVNRIELKGIDFKEDGNILGHKLEYNYNSHNVYIMADKQKNGIKVNFKIRHNIEDGSVQLADHYQQNTPIGDGPVLLPDNHYLSTQSALSKDPNEKRDHMVLLEFVTAAGI,3-ftyr-egfp,,514,484,,,,default,,,3-ftyr-egfp_default,,,,,,,,,,,,,,,,,,,,,,,,,,,,,,,,,,,,,,,,,,,,,,,,,,,,,,,,,,,,,,,,,,,,,,,b,,,,,,,,,,,,,,,,,2VPWT
,10.1126/science.273.5280.1392,,,5B,,,,,,,,,,,,,MSKGEELFTGVVPILVELDGDVNGHKFSVSGEGEGDATYGKLTLKFICTTGKLPVPWPTLVTTFTYGVQCFSRYPDHMKQHDFFKSAMPEGYVQERTIFFKDDGNYKTRAEVKFEGDTLVNRIELKGIDFKEDGNILGHKLEYNYNSHNVYIMADKQKNGIKVNFKIRHNIEDGSVQLADHYQQNTPIGDGPVLLPDNHYLSHQSALSKDPNEKRDHMVLLEFVTAAGITHGMDELYK,5b,,524,512,19400,,,default,,,5b_default,,,,,,,,,,,,,,,,,,,,,,,,,,,,,,,,,,,,,,,,,,,,,,,,,,,,,,,,,,,,,,,,,,,,,,,,,,,,,,,,,,,,,,,,G9FG2
,10.1126/science.273.5280.1392,,,6C,,,,,,,,,,,,,MSKGEELFTGVVPILVELDGDVNGHKFSVSGEGEGDATYGKLTLKFICTTGKLPVPWPTLVTTFTYGVQCFSRYPDHMKQHDFFKSAMPEGYVQERTIFFKDDGNYKTRAEVKFEGDTLVNRIELKGIDFKEDGNILGHKLEYNYNSHNVYIMADKQKNGIKVNFKIRHNIEDGSVQLADHYQQNTPIGDGPVLLPDNHYLSYQSALSKDPNEKRDHMVLLEFVTAAGITHGMDELYK,6c,,,,,,,,,,,,,,,,,,,,,,,,,,,,,,,,,,,,,,,,,,,,,,,,,,,,,,,,,,,,,,,,,,,,,,,,,,,,,,,,,,,,,,,,,,,,,,,,,,GXLGY
,10.1007/s10126-007-9049-6,AAT77753,3563998,A1a,,,,,,,,,,,,,MALSKHGLTKDMTMKYHMEGSVDGHKFVITGHGDGNPFEGKQTINLCVAEGGPLPFSEDILSAAFDYGNRVFTEYPQGMVDFFKNSCPAGYTWHRSLLFEDGAVCTTSADITVSVEENCFYHNSKFHGVNFPADGPVMKKMTTNWEPSCEKIIPVPRQGILKGDIAMYLLLKDGGRYRCQFDTIYKAKSDPKEMPEWHFIQHKLTREDRSDAKNQKWQLVEHAVASRSALPG,a1a,,,,,,,,,,,,,,,,,,,,,,,,,,,,,,,,,,,,,,,,,,,,,,,,,,,,,,,,,,,,,,,,,,,,,,,,,,,,,,,,,,,,,,,,,,,,,,,,,Q692V6,7XNWJ
,10.1021/ja3073337,,,A44-KR,,4B30,,,,,,,,,,,MEGGPALFQSDMTFKIFIDGEVNGQKFTIVADGSSKFPHGDFNAHAVCETGKLPMSWKPICHLIQYGEPFFARYPDGISHFAQECFPEGLSIDRTVRFENDGTMTSHHTYELDDTCVVSRITVNCDGFQPDGPIMRDQLVDILPNETHMFPHGPNAVRQLAFIGFTTADGGLMMGHFDSKMTFNGSRAIEIPGPHFVTIITKQMRDTSDKRDHVCQREVAYAHSVPRITSAIGSDED,a44-kr,,520,397,,,,default,,,a44-kr_default,,,,,,,,,,,,,,,,,,,,,,,,,,,,,,,,,,,,,,,,,,,,,,,,,,,,,,,,,,,,,,,,,,,,,,,b,,,,,,,,,,,,,,,,,D77WT
t,10.1371/journal.pone.0002680,AAU06856,3620752,aacuCP,,,,,,,,,,,,,MSVIAKQMTYKVYMSGTVNGHYFEVEGDGKGKPYEGEQTVKLTVTKGGPLPFAWDILSPQSQYGSIPFTKYPDDIPDYVKQSFPEGYTWERIMNFEDGAVCTVSNDSSIQGNCFIYNVKFSGLNFPPNGPVMQKKTQGWEPNTERLFARDGMLIGNNFMALKLEGGGHYLCEFKSTYKAKKPVRMPGYHYVDRKLDVTNHNRDYTSVEQCEISIARKPVVA,aacucp,,,580,109000,,,default,,,aacucp_default,,,,,,,,,,,,,,,,,,,,,,,,,,,,,,,,,,,,,,,,,,,,,,,,,,,,,,,,,,,,,,,,,,,,,,,,,,,,,,,,,,,,,,,Q66PU8,LZSRC
t,10.1371/journal.pone.0002680,AAU06848,3620743,aacuGFP1,,,,,,,,,,,,,MSLSKHGITQEMPTKYHMKGSVNGHEFEIEGVGTGHPYEGTHMAELVIIKPAGKPLPFSFDILSTVIQYGNRCFTKYPADLPDYFKQAYPGGMSYERSFVYQDGGIATASWNVGLEGNCFIHKSTYLGVNFPADGPVMTKKTIGWDKAFEKMTGFNEVLRGDVTEFLMLEGGGYHSCQFHSTYKPEKPVELPPNHVIEHHIVRTDLGKTAKGFMVKLVQHAAAHVNPLKVQ,aacugfp1,22.51,502,478,36900,,,default,,0.61,aacugfp1_default,,,,,,,,,,,,,,,,,,,,,,,,,,,,,,,,,,,,,,,,,,,,,,,,,,,,,,,,,,,,,,,,,,,,,,,b,,,,,,,,,,,,,,,,Q66PV6,498LC
t,10.1371/journal.pone.0002680,AAU06845,3620755,aacuGFP2,,,,,,,,,,,,,MSYSKQGIVQEMKTKYRMEGSVNGHEFTIEGVGTGYPYEGKQMSELVIIKPKGKPLPFSFDILSSVFQYGNRCFTKYPADMPDYFKQAFPDGMSYERSFLFEDGAVATASWNIRLEGNCFIHNSIFHGVNFPADGPVMKKKTIGWDKSFEKMTVSKEVLRGDVTMFLMLEGGGYHRCQFHSTYKTEKPVELPPNHVVEHQIVRTDLGQSAKGFTVKLEAHAAAHVNPLKVQ,aacugfp2,66.67,513,502,93900,,,default,,0.71,aacugfp2_default,,,,,,,,,,,,,,,,,,,,,,,,,,,,,,,,,,,,,,,,,,,,,,,,,,,,,,,,,,,,,,,,,,,,,,,b,,,,,,,,,,,,,,,,Q66PV9,3W5ZV
d,10.1101/677344,,,AausFP1,,,,,,,,,,,,,MSYGALLFREKIPYVVEMEGDVEGMKFSVRGKGHGDANTGKIEASFICTTGELPVPWSSILTTVTYGAQCFAKYPNDIKDYPKSAMPEGYVQERTITFENDGVYKTRAEVTYEKGSVYNRVTLNGSGFKKGGNILGKKLEFNYNPHCIYVLPDVQNNGIKCYINIVHDVIGGGQIIAAHQQLNTPLGGGPVDIPHYHHIQAHTILSKDPKETRDHMNVVEVFRAIDCKTAYA,aausfp1,164.9,510,504,170000,,,default,4.4,0.97,aausfp1_default,,,,,,,,,,,,,,,,,,,,,,,,,,,,,,,,,,,,,,,,,,,,,,,,,,,,,,,,,,,,,,,,,,,,,,,b,,,,,,,,,,,,,,,,,C2FJQ
,10.1101/677344,,,AausFP2,,,,,,,,,,,,,MACGALLFKGKIPFVVELEGDVNGEVFSVRGNGWGDGSTGKLEIKFVCTTGEVPLAWESLICSMAYGALVFCKYPSNINDFFKSTMPRGYIQERKISYENDGTFDVRQEVTYENGALYNRVKFNGSGFRKDGNVLGKKLDLTSIGTCIYIMGNDEGTGLKGVFNKAFKVIGGNRQIASHVQTQTPIGDGLVSIPDYHVMHNHIACSKDPSETRDHIIVKESLRAVDCNTEYM,aausfp2,,,609,52000,,,default,6.0,,aausfp2_default,,,,,,,,,,,,,,,,,,,,,,,,,,,,,,,,,,,,,,,,,,,,,,,,,,,,,,,,,,,,,,,,,,,,,,,b,,,,,,,,,,,,,,,,,UHNQV
,10.1101/677344,,,AausFP3,,,,,,,,,,,,,MACGALLFKGKIPFVVELEGDVNGEVFSVRGNGWGDGSTGKIEIKFVCTTGEIPVAWESLVCSLAYGALVFAKYPSNINDFFKSTMPKGYIQERNIQFENDGQYVTRAEVTYENGTLYNRVKLNGSGFRKDGNILGKKLDSTSLGTCIYIMGNDQGNGLKGVYNKAYKVIGGNRQLASHQQTHTPIGDGLVSIPDYHVMHNHIACSKDPSETRDHIIVKESLRAVDCNTEYM,aausfp3,,,587,59000,,,default,6.5,,aausfp3_default,,,,,,,,,,,,,,,,,,,,,,,,,,,,,,,,,,,,,,,,,,,,,,,,,,,,,,,,,,,,,,,,,,,,,,,b,,,,,,,,,,,,,,,,,OEVJT
d,10.1101/677344,,,AausFP4,,,,,,,,,,,,,MNCGALLFQQKVPFIVEMEGDVNGEIFSVRGNGFGNATTGKLDILFVCTTGEIPVAWESLISSLAYGAFVFAKYPSNIADFFKSTMPEGYIQERKVTFENDGTYETHATVTYENGAIFERVKLTGTGFREDGNILGKKLEITSLGTPLSIMADDEGKGLRSVFNQAIKVVGGNRQIAIHEQRNRPIGDGLISVPDYHTLHNHLKCSKVSTEKRDHMMVNETLKAIDCQTAYL,aausfp4,,513,477,69000,,,On,,,aausfp4_on,,,,,,,Off,,0.001,aausfp4_off,,,,,,,,,,,,,,,,,,,,,,,,,,,,,,,,,,,,,,,,,,,,,,,,,,,,,,,,,,,,,ps,aausfp4_off,aausfp4_on,340,aausfp4_on,aausfp4_off,480,,,,,,,,,,,F5F6H
d,10.1101/677344,,,AausGFP,,,,,,,,,,,,,MKIYCEGEKLFKGIVPIQIELNGDVNGHKFSVHGEGQGEAEMGRLTLRFVCTTGKMPVPWPTLVTTFSYGVQCFSRYPEHMKMHDFFKSAMPEGYTQERTIFFDKDGTYKTRAEVKFEGDTLVNRIELTGTGFKEDGNILGHKMEYNYNSHNVYIMSDKAKNGIKVNFKIRHNIEDGTVQLADHYQANYPLGKGPVLLPEDHYLSTQSALTKDPHETRDHMLLLEFVTAAGITHGMDELYK,aausgfp,21.17,503,398,29000,,,default,4.8,0.73,aausgfp_default,,,,,,,,,,,,,,,,,,,,,,,,,,,,,,,,,,,,,,,,,,,,,,,,,,,,,,,,,,,,,,,,,,,,,,,b,,,,,,,,,,,,,,,,,D7QYG
,10.1093/molbev/msp194,ACV52387,18466459,acanFP,,,,,,,,,,,,,AIKPDMKIKLCMEGAVNGHPFMIEGEGKGKPFDGKQNMELKVKEGGPLPFAYDILTTVFNYGNRVFAKYPRDIADYFKQSFPEGFSWERSMAYEDGGICIATNNITLMKGDCFXYXIRFDGVNFPANXPVMQKKXVKWEPSTEKLYVRDGVLKGDINMALLLEGGGHYRCDFKTT,acanfp,,,,,,,,,,,,,,,,,,,,,,,,,,,,,,,,,,,,,,,,,,,,,,,,,,,,,,,,,,,,,,,,,,,,,,,,,,,,,,,,,,,,,,,,,,,,,,,,,D1KWU4,24DHR
m,10.1074/jbc.m109.092320,AAN41637,1780484,aceGFP,,3LVA,,,,,,,,,,,MSKGAELFTGIVPILIELNGDVNGHKFSVSGEGEGDATYGKLTLKFICTTGKLPVPWPTLVTTLSYGVQCFSRYPDHMKQHDFFKSAMPEGYIQERTIFFEDDGNYKSRAEVKFEGDTLVNRIELTGTDFKEDGNILGNKMEYNYNAHNVYIMTDKAKNGIKVNFKIRHNIEDGSVQLADHYQQNTPIGDGPVLLPDNHYLSTQSALSKDPNEKRDHMIYFGFVTAAAITHGMDELYK,acegfp,27.5,505,480,50000,,,default,,0.55,acegfp_default,,,,,,,,,,,,,,,,,,,,,,,,,,,,,,,,,,,,,,,,,,,,,,,,,,,,,,,,,,,,,,,,,,,,,,,b,,,,,,,,,,,,,,,,Q6YGZ0,GQRF2
m,10.1074/jbc.m109.092320,,,aceGFP-G222E-Y220L,,,,,,,,,,,,,MSKGAELFTGIVPILIELNGDVNGHKFSVSGEGEGDATYGKLTLKFICTTGKLPVPWPTLVTTLSYGVQCFSRYPDHMKQHDFFKSAMPEGYIQERTIFFEDDGNYKSRAEVKFEGDTLVNRIELTGTDFKEDGNILGNKMEYNYNAHNVYIMTDKAKNGIKVNFKIRHNIEDGSVQLADHYQQNTPIGDGPVLLPDNHYLSTQSALSKDPNEKRDHMILFEFVTAAAITHGMDELYK,acegfp-g222e-y220l,,508,396,,,,default,,,acegfp-g222e-y220l_default,,,,,,,,,,,,,,,,,,,,,,,,,,,,,,,,,,,,,,,,,,,,,,,,,,,,,,,,,,,,,,,,,,,,,,,b,,,,,,,,,,,,,,,,,DH5VX
,10.1042/bj20021966,AAP69597,1780523,aceGFP-h,,,,,,,,,,,,,SKGAELFTGIVPILIELNGDVNGHKFSVSGEGEGDATYGKLTLKFICTTGKLPVPWPTLVTTLSYGVQCFSRYPDHMKQHDFFKSAMPEGYIQERTIFFEDDGNYKSRAEVKFEGDTLVNRIELTGTDFKEDGNILGNKMEYNYNAHNVYIMTDKAKNGIKVNFKIRHNIEDGSVQLADHYQQNTPIGDGPVLLPDNHYLSTQSALSKDPNEKRDHMIYFGFVTAAAITHGMDELYK,acegfp-h,,505,390,,,,default,,,acegfp-h_default,,,,,,,,,,,,,,,,,,,,,,,,,,,,,,,,,,,,,,,,,,,,,,,,,,,,,,,,,,,,,,,,,,,,,,,b,,,,,,,,,,,,,,,,,WBLSA
wd,,,,AcGFP1,,,,,,,,,,,,,MVSKGAELFTGIVPILIELNGDVNGHKFSVSGEGEGDATYGKLTLKFICTTGKLPVPWPTLVTTLSYGVQCFSRYPDHMKQHDFFKSAMPEGYIQERTIFFEDDGNYKSRAEVKFEGDTLVNRIELTGTDFKEDGNILGNKMEYNYNAHNVYIMTDKAKNGIKVNFKIRHNIEDGSVQLADHYQQNTPIGDGPVLLPDNHYLSTQSALSKDPNEKRDHMIYFGFVTAAAITHGMDELYK,acgfp1,27.5,505,475,50000,,,default,,0.55,acgfp1_default,,,,,,,,,,,,,,,,,,,,,,,,,,,,,,,,,,,,,,,,,,,,,,,,,,,,,,,,,,,,,,,,,,,,,,,b,,,,,,,,,,,,,,,,,6ORKJ
,10.1038/s41586-019-1882-z,LC381432,,Achilles,,,,,,,,,,,,,MVSKGEELFTGVVPILVELDGDVNGHKFSVRGEGEGDATIGKLTLKLICTTGKLPVPWPTLVTTLGYGLAVFARYPDHMKQHDFFKSAMPEGYVQERTIFFKDDGNYKTRAEVKFEGDTLVNRIELKGSGFKEDGNILGHKLEYNFNSHNVYITADKQKNGIKANFKIRHNIEDGGVQLADHYQQNTPIGDGPVLLPDNHYLSYQSFLSKDPNEKRDHMVLLEFVTAAGITLGMDELYK,achilles,70.4,525,513,110000,,,default,5.5,0.64,achilles_default,,,,,,,,,,,,,,,,,,,,,,,,,,,,,,,,,,,,,,,,,,,,,,,,,,,,,,,,,,,,,,,,,,,,,,,b,,,,,,,,,,,,,,,,,MLHQR
t,10.1002/pro.3540,,,AdRed,,6AA7,,,,,,,,,,,MALSKHGLTKDMTMKYRMEGCVDGHKFVITGHGNGSPFEGKQTINLCVVEGGPLPFSEDILSAVFDYGNRVFTDYPQGMVDFFKNSCPAGYTWQRSLLFEDGAVCTASADITVSVEENCFYHESKFHGVNFPADGPVMKKMTINWEPCCEKIIPVPRQGILKGDVAMYLLLKDGGRYRCQFDTVYKAKTDSKKMPEWHFIQHKLTREDRSDAKNQKWQLAEHSVASRSALP,adred,,612,567,,,,default,4.0,,adred_default,,,,,,,,,,,,,,,,,,,,,,,,,,,,,,,,,,,,,,,,,,,,,,,,,,,,,,,,,,,,,,,,,,,,,,,b,,,,,,,,,,,,,,,,A0A1S7IWI8,DAH3B
,10.1002/pro.3540,,,AdRed-C148S,,,,,,,,,,,,,MALSKHGLTKDMTMKYRMEGCVDGHKFVITGHGNGSPFEGKQTINLCVVEGGPLPFSEDILSAVFDYGNRVFTDYPQGMVDFFKNSCPAGYTWQRSLLFEDGAVCTASADITVSVEENCFYHESKFHGVNFPADGPVMKKMTINWEPSCEKIIPVPRQGILKGDVAMYLLLKDGGRYRCQFDTVYKAKTDSKKMPEWHFIQHKLTREDRSDAKNQKWQLAEHSVASRSALP,adred-c148s,,599,560,,,,default,,,adred-c148s_default,,,,,,,,,,,,,,,,,,,,,,,,,,,,,,,,,,,,,,,,,,,,,,,,,,,,,,,,,,,,,,,,,,,,,,,b,,,,,,,,,,,,,,,,,THMOX
t,10.1371/journal.pone.0002680,ACD13192,14926073,aeurGFP,,,,,,,,,,,,,MSYSKQGIVQEMKTKYHMEGSVNGHEFTIEGVATGYPYEGKQMSELVIIKPKGKPLPFSFDILSSVFQYGNRCFTKYPADIPDYFKQAFPDGMSYERSFLFEDGAVATASWNIRLEGNCFIHNSIFHGVNFPADGPVMKKQTIGWDKSFEKMTVSKEVLRGDVTMFLMLEGGGYHRCQFHSTYKTEKPVTLPPNHVVEHQIVRTDLGQSAKGFTVKLEALAAAHVNPLKVQ,aeurgfp,97.62,515,504,145700,,,default,,0.67,aeurgfp_default,,,,,,,,,,,,,,,,,,,,,,,,,,,,,,,,,,,,,,,,,,,,,,,,,,,,,,,,,,,,,,,,,,,,,,,b,,,,,,,,,,,,,,,,B6CTZ3,4NRYW
t,10.1371/journal.pone.0002680,AAU06857,3620756,afraGFP,,,,,,,,,,,,,MSVIVKEMMTKLHMEGTVNGHAFTIEGKGKGDPYNGVQSMNLDVKGGAPLPFSFDLLTPAFMYGNRVFTKYPEDIPDFFKQVFPEGYHWERSITFEDQAVCTATSHIRLDQKEMCFIYDVRFHGVNFPANGPIMQKKILGWEPSTEKMYARDGVLKGDVNMTLRVEGGGHYRADFRTTYKAKKPVNLPGYHFIDHRIEITKHSKDYTNVALYEAAVARHSPLPKVA,afragfp,61.49,503,494,100800,,,default,,0.61,afragfp_default,,,,,,,,,,,,,,,,,,,,,,,,,,,,,,,,,,,,,,,,,,,,,,,,,,,,,,,,,,,,,,,,,,,,,,,b,,,,,,,,,,,,,,,,Q66PU5,T5A9C
t,10.1371/journal.pone.0002680,AAU06855,3620745,ahyaCP,,,,,,,,,,,,,MSVIATQMTYKVYMSGTVNGHYFEVEGDGKGKPYEGEQTVRLTVTKGGPLPFAWDILSPQSQYGSIPFTKYPEDIPDYVKQSFPEGYTWERIMNFEDGAVCTVSNDSSIQGNCFIYHVKFSGLNFPPNGPVMQKKTQGWEPNTERLFARDGVLIGNNFMALKLEGGGHYLCEFKSTYKAKKPVKMPGYHFVDRKLDVTNHNKDYTSVEQREISIARKPVVA,ahyacp,,,580,132000,,,default,,,ahyacp_default,,,,,,,,,,,,,,,,,,,,,,,,,,,,,,,,,,,,,,,,,,,,,,,,,,,,,,,,,,,,,,,,,,,,,,,,,,,,,,,,,,,,,,,Q66PU9,QSSEE
t,10.1021/bp034308g,AAS18270,2033734,alajGFP1,,,,,,,,,,,,,MSLSKQVIGKEMNMTYLMDGSVNGHNFTVEGEGDGKPYEGHQCLKLRITKGEPLPFAFDILTAAFCYGNRCFVNYPAEIADYFKQAFPEGLTWERSMTFEDGGFAAVSADISLNGNCFVHQSKFVGVNFPADGPVMQKKTVGWEPSTEKMIVRDGILEGDVTMYLKLEGGGNYRCEYRTIYKAKKDVKMPKSHFVEHTLVRNNIKKDAKGNTIELIEDASARY,alajgfp1,,517,509,,,,default,,,alajgfp1_default,,,,,,,,,,,,,,,,,,,,,,,,,,,,,,,,,,,,,,,,,,,,,,,,,,,,,,,,,,,,,,,,,,,,,,,b,,,,,,,,,,,,,,,,Q6R8F5,LBAXM
t,10.1021/bp034308g,AAS18271,2033714,alajGFP2,,,,,,,,,,,,,MVLSKQMNMTYLMDGSVNGHNFTVEGEGDGKPYEGHQCLKLRITKGEPLPFAFDILTAAFCYGNRCFVNYPAEIADYFKQAFPEGLTWERSMTFEDGGFAAVSADLSLKNGNWFVHQSKFVGVNFPADGPVMQKKTVGWEPSTEKMIVRDGTLEGDVTMYLKLEGGGNYRCDYRTIYKAKKDVKMPKSHFVEHTLVRNNIKKDAKGNTIELIEDASARY,alajgfp2,,517,509,,,,default,,,alajgfp2_default,,,,,,,,,,,,,,,,,,,,,,,,,,,,,,,,,,,,,,,,,,,,,,,,,,,,,,,,,,,,,,,,,,,,,,,b,,,,,,,,,,,,,,,,Q6R8F4,RFJ23
t,10.1021/bp034308g,AAS18272,2033751,alajGFP3,,,,,,,,,,,,,MALSKQEIKKEMTMDYVMDGCVNGHSFTVKGDGAGKPYEGHQRLSLHVTGGQPLPFAFDILSAAFAYGNRCFTKYPKEIPDMFKQAFPGGMSWERTMTFEDGGVASVSADISIEKDGCFKHRSKFVGVNFPVNGPVMQNKTRGWEPSIEKMTVRDGTLKGHVTMFLKLEGGGNYRCDFETTYKAKKAVKMLDSHFIEHRLVTTIRGNNVELQEDAEARNSGLGECK,alajgfp3,,504,494,,,,default,,,alajgfp3_default,,,,,,,,,,,,,,,,,,,,,,,,,,,,,,,,,,,,,,,,,,,,,,,,,,,,,,,,,,,,,,,,,,,,,,,b,,,,,,,,,,,,,,,,Q6R8F3,V25UH
,10.1083/jcb.202209077,,,Alexa Fluor Plus 800,,,,,,,,,,,,,,alexa-fluor-plus-800,,794,789,,,,Alexa Fluor Plus 800,,,alexa-fluor-plus-800_alexa-fluor-plus-800,,,,,,,,,,,,,,,,,,,,,,,,,,,,,,,,,,,,,,,,,,,,,,,,,,,,,,,,,,,,,,,,,,,,,,,b,,,,,,,,,,,,,,,,,L76OZ
d,10.1038/nbt0396-315,,,&alpha;GFP,,,,,,,,,,,,,MSKGEELFTGVVPILVELDGDVNGHKFSVSGEGEGDATYGKLTLKFICTTGKLPVPWPTLVTTFSYGVQCFSRYPDHMKRHDFFKSAMPEGYVQERTISFKDDGNYKTRAEVKFEGDTLVNRIELKGIDFKEDGNILGHKLEYNYNSHNVYITADKQKNGIKANFKIRHNIEDGSVQLADHYQQNTPIGDGPVLLPDNHYLSTQSALSKDPNEKRDHMVLLEFVTAAGITHGMDELYK,alphagfp,23.7,506,397,30000,,,default,,0.79,alphagfp_default,,,,,,,,,,,,,,,,,,,,,,,,,,,,,,,,,,,,,,,,,,,,,,,,,,,,,,,,,,,,,,,,,,,,,,,b,,,,,,,,,,,,,,,,,B28N7
t,,,,amCyan1,,,,,,,,,,,,,MALSNKFIGDDMKMTYHMDGCVNGHYFTVKGEGSGKPYEGTQTSTFKVTMANGGPLAFSFDILSTVFMYGNRCFTAYPTSMPDYFKQAFPDGMSYERTFTYEDGGVATASWEISLKGNCFEHKSTFHGVNFPADGPVMAKMTTGWDPSFEKMTVCDGILKGDVTAFLMLQGGGNYRCQFHTSYKTKKPVTMPPNHAVEHRIARTDLDKGGNSVQLTEHAVAHITSVVPF,amcyan1,,486,453,,,,default,,,amcyan1_default,,,,,,,,,,,,,,,,,,,,,,,,,,,,,,,,,,,,,,,,,,,,,,,,,,,,,,,,,,,,,,,,,,,,,,,b,,,,,,,,,,,,,,,,,L5QET
t,10.1038/13657,AAF03371,1173879,amFP486,,2A46,,,,,,,,,,,MALSNKFIGDDMKMTYHMDGCVNGHYFTVKGEGNGKPYEGTQTSTFKVTMANGGPLAFSFDILSTVFKYGNRCFTAYPTSMPDYFKQAFPDGMSYERTFTYEDGGVATASWEISLKGNCFEHKSTFHGVNFPADGPVMAKKTTGWDPSFEKMTVCDGILKGDVTAFLMLQGGGNYRCQFHTSYKTKKPVTMPPNHVVEHRIARTDLDKGGNSVQLTEHAVAHITSVVPF,amfp486,9.6,486,458,40000,,,default,,0.24,amfp486_default,,,,,,,,,,,,,,,,,,,,,,,,,,,,,,,,,,,,,,,,,,,,,,,,,,,,,,,,,,,,,,,,,,,,,,,b,,,,,,,,,,,,,,,,Q9U6Y6,1M48O
t,10.1073/pnas.0502250102,,,amFP495,,,,,,,,,,,,,MALSNKFIGDDMKMTYHMDGCVNGHYFTVKGEGNGKPYEGTQTSTFKVTMANGGPLAFSFDILSTVFKYGNRCFTAYPTSMPDYFKQAFPDGMSYERTFTYEDGGVATASWEISLKGNCFEHKSTFHGVNFPADGPVMAKKTTGWDPSFEKMTVCDGILKGDVTAFLMLQGGGNYRCQFHTSYKTKKPVTMPPNHVVEHRIARTDLDKGGNSVQLTQHAVAHITSVVPF,amfp495,,495,467,,,,default,,0.08,amfp495_default,,,,,,,,,,,,,,,,,,,,,,,,,,,,,,,,,,,,,,,,,,,,,,,,,,,,,,,,,,,,,,,,,,,,,,,b,,,,,,,,,,,,,,,,,ANK6E
t,10.1073/pnas.0502250102,,,amFP506,,2A48,,,,,,,,,,,MALSNKFIGDDMKMTYHMDGCVNGHYFTVKGEGNGKPYEGTQTSTFKVTMANGGPLAFSFDILSTVFKYGNRCFTAYPTSMPDYFKQAFPDGMSYERTFTYEDGGVATASWEISLKGNCFEHKSTFHGVNFPADGPVMAKKTTGWDPSFQKMTVCDGILKGDVTAFLMLQGGGNYRCQFHTSYKTKKPVTMPPNHVVEHRIARTDLDKGGNSVQLTEHAVAHITSVVPF,amfp506,,506,483,,,,default,,0.67,amfp506_default,,,,,,,,,,,,,,,,,,,,,,,,,,,,,,,,,,,,,,,,,,,,,,,,,,,,,,,,,,,,,,,,,,,,,,,b,,,,,,,,,,,,,,,,,VQMW2
t,10.1073/pnas.0502250102,,,amFP515,,2A47,,,,,,,,,,,MALSNKFIGDDMKMTYHMDGCVNGHYFTVKGEGNGKPYEGTQTSTFKVTMANGGPLAFSFDILSTVFKYGNRCFTAYPTSMPDYFKQAFPDGMSYERTFTYEDGGVATASWEISLKGNCFEHKSTFHGVNFPADGPVMAKKTTGWDPSFEKMTVCDGILKGDVTAFLMLQGGGNYRCQFHTSYKTKKPVTMPPNHVVETRIARTDLDKGGNSVQLTEHAVAHITSVVPF,amfp515,,515,500,,,,default,,0.006,amfp515_default,,,,,,,,,,,,,,,,,,,,,,,,,,,,,,,,,,,,,,,,,,,,,,,,,,,,,,,,,,,,,,,,,,,,,,,b,,,,,,,,,,,,,,,,,8KFSR
t,10.1371/journal.pone.0002680,AAU06854,3620739,amilCP,,7SWS,,,,,,,,,,,MSVIAKQMTYKVYMSGTVNGHYFEVEGDGKGKPYEGEQTVKLTVTKGGPLPFAWDILSPQCQYGSIPFTKYPEDIPDYVKQSFPEGYTWERIMNFEDGAVCTVSNDSSIQGNCFIYHVKFSGLNFPPNGPVMQKKTQGWEPNTERLFARDGMLLGNNFMALKLEGGGHYLCEFKTTYKAKKPVKMPGYHYVDRKLDVTNHNKDYTSVEQCEISIARKPVVA,amilcp,,,588,87600,,54.0,default,,,amilcp_default,,,,,,,,,,,,,,,,,,,,,,,,,,,,,,,,,,,,,,,,,,,,,,,,,,,,,,,,,,,,,,,,,,,,,,,,,,,,,,,,,,,,,,,Q66PV0,18KQQ
,10.1007/s00338-012-0994-9,AGH32877,34398772,amilCP580,,,,,,,,,,,,,MSVIAKQMTYKVYMSGTVNGHYFEVEGDGKGKPYEGEQTVKLTVTKGGPLPFAWDILSPQSQYGSIPFTKYPEDIPDYVKQSFPEGYTWERIMNFEDGAVCTVSNDSSIQGNCFIYHVKFSGLNFPPNGPVMQKKTQGWEPNTERLFARDGMLIGNNFMALKLEGGGHYLCEFKSTYKAKKPVKMPGYHYVDRKLDVTNHNKDYTSVEQREISIARKPVVA,amilcp580,,,580,,,,default,,,amilcp580_default,,,,,,,,,,,,,,,,,,,,,,,,,,,,,,,,,,,,,,,,,,,,,,,,,,,,,,,,,,,,,,,,,,,,,,,,,,,,,,,,,,,,,,,M4R4D0,87PXJ
,10.1007/s00338-012-0994-9,AGH32878,34398773,amilCP586,,,,,,,,,,,,,MSVIAKQMTYKVYVSGTVNGHYFEVEGDGKGKPYEGEQTVRLAVTKGGPLPFAWDILSPQCQYGSIPFTKYPEDIPDYVKQSFPEGYTWERIMNFEDGAVCTVSNDSSIQGNCFIYHVKFSGLNFPPNGPVMQKKTQGWEPNTERLFARDGMLIGNNFMALKLEGGGHYLCEFKSTYKAKKPVKMPGYHYVDRKLDVTNHNKDYTSVEQREISIARKPVVA,amilcp586,,,586,,,,default,,,amilcp586_default,,,,,,,,,,,,,,,,,,,,,,,,,,,,,,,,,,,,,,,,,,,,,,,,,,,,,,,,,,,,,,,,,,,,,,,,,,,,,,,,,,,,,,,M4QUP7,VAFG4
,10.1007/s00338-012-0994-9,AGH32876,34398771,amilCP604,,,,,,,,,,,,,MSVIAKQMTYKAYMSGTVNGHYFEVEGDGKGKPYEGEQTEKLTVTKGGPLPFAWDILSPQCQYGSIPFTKYPEDIPDYVKQSFPEGFTWERIMNFEDGAVCTVTNDSSIQGNCFIYHVKFSGLNFPPNGPVMQKKTQGWEPHSERLLARDGMLIGNNFMALKLEGGGHYLCEFKTTYKAKKPVKMPGYHYVDRKLDVTNHNKDYTSVEQREISIARKPVVA,amilcp604,,,604,,,,default,,,amilcp604_default,,,,,,,,,,,,,,,,,,,,,,,,,,,,,,,,,,,,,,,,,,,,,,,,,,,,,,,,,,,,,,,,,,,,,,,,,,,,,,,,,,,,,,,M4QSB1,YEF5F
t,10.3354/meps07588,ACH89426,15616240,amilFP484,,,,,,,,,,,,,MSYSKQGIVQEMKTKYHMEGSVNGHEFTIEGVGTGNPYEGTQMSELVITKPAGKPLPFSFDILSTVFQYGNRCFTKYPEGMTDYFKQAFPDGMSYERSFLYEDGGVATASWNIRLERDCFIHKSIYHGVNFPADGPVMKKKTIGWDKAFEKMTVSKDVLRGDVTEFLMLEGGGYHSCQFHSTYKPEKPVTLPPNHVVEHHIVRTDLGQRAKGFTVKLEEHAAAHVNPLKVK,amilfp484,,484,420,,,,default,,,amilfp484_default,,,,,,,,,,,,,,,,,,,,,,,,,,,,,,,,,,,,,,,,,,,,,,,,,,,,,,,,,,,,,,,,,,,,,,,b,,,,,,,,,,,,,,,,B5T1L2,9MM4N
,10.1002/jemt.20410,AAU06849,3620749,amilFP490,,,,,,,,,,,,,MSYSKQGIAQVMKTKYHMEGSVNGHEFTIEGVGTGNPYEGTQMSELVITKPAGKPLPFSFDILSTVFQYGNRCFTKYPEGMTDYFKQAFPDGMSFERSFLYEDGGVATASWNIRLERDCFIHKSIYHGVNFPADGPVMKKKTIGWDKAFEKMTVSKDVLRGDVTEFLMLEGGGYHSCQFHSTYKPEKPVTLPPNHVVEHHIVRTDLGQTAKGFTVKLEEHAAAHVNPLKVQ,amilfp490,26.55,490,424,29500,,,default,,0.9,amilfp490_default,,,,,,,,,,,,,,,,,,,,,,,,,,,,,,,,,,,,,,,,,,,,,,,,,,,,,,,,,,,,,,,,,,,,,,,b,,,,,,,,,,,,,,,,Q66PV5,VAXZZ
t,10.3354/meps07588,ACH89427,15616241,amilFP497,,,,,,,,,,,,,MSYSKQGIVQAMKTKYHMEGSVNGHEFTIEGVGTGNPYEGTQMSELVITKPAGKPLPFSFDILSTVFQYGNRCFTKYPEGMTDYFKQAFPDGMSYERSFLFEDGGVATASWNIRLEGDCFIHKSIYHGVNFPADGPVMKKKTIGWEKSFEKMTVSKDVLRGDVTMFLMLEGGGYHRCQFHSTYKPEKPGTLPPNHVVEHHIVRTDLGQSAKGFTVKLEEHAAAHVNPLKVK,amilfp497,,497,477,,,,default,,,amilfp497_default,,,,,,,,,,,,,,,,,,,,,,,,,,,,,,,,,,,,,,,,,,,,,,,,,,,,,,,,,,,,,,,,,,,,,,,b,,,,,,,,,,,,,,,,B5T1L3,VGW8W
,10.1002/jemt.20410,ABB17973,4901501,amilFP504,,,,,,,,,,,,,MSYSKQGIVQEMKTKYHMEGSVNGHEFTIEGVGTGYPYEGKQISELVIIKPAGKPLPFSFDILSSVFQYGNRCFTKYPADMPDYFKQAFPDGMSYERSFLFEDGAVATASWNIRLEGNCFIHKSIFHGVNFPADGPVMKKKTIDWDKSFEKMTVSKEVLRGDVTMFLMLEGGGSHRCQFHSTYKTEKPVTLPPNHVVEHQIVRTDLGQTAKGFTVKLEEHAAAHVSL,amilfp504,,504,488,,,,default,,,amilfp504_default,,,,,,,,,,,,,,,,,,,,,,,,,,,,,,,,,,,,,,,,,,,,,,,,,,,,,,,,,,,,,,,,,,,,,,,b,,,,,,,,,,,,,,,,A8CLY3,WQ5JF
t,10.3354/meps07588,ACH89428,15616242,amilFP512,,,,,,,,,,,,,MSYSKQGIVQEMKTKYHMEGSVNGHEFTIEGVGTGYPYEGKQMSELVIIKPAGKPLPFSFDILSSVFQYGNRCFTKYPADMPDYFKQAFPDGMSYERSFLFEDGAVATASWKIRLEGNCFIHNSIFHGVNFPADGPVMKKKTIGWDKSFEKMTVSKEVLRGDVTMFLMLEGGGSHRCQFHSTYKTEKPVTLPPNHVVEHQIVRTDLGQSAKGFTVKLEAHAAAHVNPLKVK,amilfp512,,512,500,,,,default,,,amilfp512_default,,,,,,,,,,,,,,,,,,,,,,,,,,,,,,,,,,,,,,,,,,,,,,,,,,,,,,,,,,,,,,,,,,,,,,,b,,,,,,,,,,,,,,,,B5T1L4,Q3VS4
t,10.1002/jemt.20410,AAU06846,3620747,amilFP513,,,,,,,,,,,,,MSYSKQGIVQEMKTKYHMEGSVNGHEFTIEGVGTGYPYEGKQMSELVIIKPAGKPLPFSFDILSSVFQYGNRCFTKYPADMPDYFKQAFPDGMSYERSFLFEDGAVATASWNIRLEGNCFIHKSIFHGVNFPADGPVMKKKTIDWDKSFEKMTVSKEVLRGDVTMFLMLEGGGSHRCQFHSTYKTEKPVTLPPNHVVEHQIVRTDLGQSAKGFTVKLEAHAAAHVNPLKVK,amilfp513,50.38,513,504,75200,,,default,,0.67,amilfp513_default,,,,,,,,,,,,,,,,,,,,,,,,,,,,,,,,,,,,,,,,,,,,,,,,,,,,,,,,,,,,,,,,,,,,,,,b,,,,,,,,,,,,,,,,Q66PV8,LO7EL
t,10.1002/jemt.20410,AAU06852,3620742,amilFP593,,,,,,,,,,,,,MALSKHGLTKDMTMKYHMEGSVDGHKFVITGHGNGNPFEGKQTMNLCVVEGGPLPFSEDILSAAFDYGNRVFTEYPQGMVDFFKNSCPAGYTWHRSLLFEDGAVCTTSADITVSVEENCFYHNSKFHGVNFPADGPVMKKMTTNWEPSCEKIIPVPRQGILKGDIAMYLLLKDGGRYRCQFDTIYKAKSDPKEMPEWHFIQHKLTREDRSDAKNQKWQLVEHAVASRSALPG,amilfp593,44.54,593,562,90900,,,default,,0.49,amilfp593_default,,,,,,,,,,,,,,,,,,,,,,,,,,,,,,,,,,,,,,,,,,,,,,,,,,,,,,,,,,,,,,,,,,,,,,,b,,,,,,,,,,,,,,,,Q66PV2,VDDDT
t,10.3354/meps07588,ACH89429,15616243,amilFP597,,,,,,,,,,,,,MALSKHGLTKDMTMKYHMEGSVDGHKFVITGHGNGNPFEGKQTVNLCVAEGGPLPFSEDILSAAFDYGNRVFTEYPQGMVDFFKNSCPAGYTWHRSLLFEDGAVCTTSADITVSVEENCFYHNSKFHGVNFPADGPVMKKMTTNWEPSCEKIIPVPRQGILKGDIAMYLLLKDGGRYRCQFDTIYKAKSDPKEMPEWHFIQHKLTREDRSDAKNQKWQLVEHAVASRSALPG,amilfp597,,597,558,,,,default,,,amilfp597_default,,,,,,,,,,,,,,,,,,,,,,,,,,,,,,,,,,,,,,,,,,,,,,,,,,,,,,,,,,,,,,,,,,,,,,,b,,,,,,,,,,,,,,,,B5T1L5,2YKB1
d,10.1093/molbev/msh079,AAR85350,1978515,anm1GFP1,,,,,,,,,,,,,MNVMRYNRGFCRVLQNGVKNLRSRNCSTEEKPVILGAMTETFQKKLPYKLELDGDVDGQTFKVIGEGVGDATTGVIEGKYVCTEGEVPISWVSLITSLSYGAKCFVRYPNEINDFFKSTFPSGYHQERKITYENDGVLETAAKITMESGAIVNRINVKGTGFDKDGHVCQKNLESSPPSTTYVVPEGEGIRIIYRNIYPTKDGHYVVADTQQVNRPIRAQGTSAIPTYHHIKSKVDLSTDPEENKDHIIIKETNCAFDADFS,anm1gfp1,48.75,495,475,75000,,,default,,0.65,anm1gfp1_default,,,,,,,,,,,,,,,,,,,,,,,,,,,,,,,,,,,,,,,,,,,,,,,,,,,,,,,,,,,,,,,,,,,,,,,b,,,,,,,,,,,,,,,,Q6RYS6,S1U3D
d,10.1093/molbev/msh079,AAR85351,1978498,anm1GFP2,,,,,,,,,,,,,MAEYFEKPLPYKVELEGDVDGQKFTVIGEGQGDASTGRVEGKYVCTKGEVPISWVSLITSLSYGGKCFVRYPNVIKDFFKSTFPTGYHQERKITYEDDGVLETAAKVTLESGAIYNRISVKGVGFKKDGNVCKKRLHSSPPQVSYVVPYGEGIRVLYSNIYPTKDGGYVVADTRQVNRPIKAEGKSAIPKYHYIKSKIDLSTDPNERKDHIIIKEVNVASGIDFS,anm1gfp2,,504,490,,,,default,,,anm1gfp2_default,,,,,,,,,,,,,,,,,,,,,,,,,,,,,,,,,,,,,,,,,,,,,,,,,,,,,,,,,,,,,,,,,,,,,,,b,,,,,,,,,,,,,,,,Q6RYS5,YV34T