agg,doi,genbank,ipg_id,name,pdb.0,seq,slug,states.0.brightness,states.0.em_max,states.0.ex_max,states.0.ext_coeff,states.0.lifetime,states.0.maturation,states.0.name,states.0.pka,states.0.qy,states.0.slug,switch_type,uniprot,uuid
m,10.1073/pnas.1807449115,MK040729,,mGinger1,,MLLKENMHIKMYMEGTVNGHYFKCKGEGDGNPFAGTQSMRVHVTEGAPLPFAFDILAPCCEYGSKTFVRYPADIPDFFKQSFPEGFTWERTTTYEDGGILTAHQDTSLEGNCLIYKVKVHGTNFPADGPVMKKETCGWEPSTESVYPENGVLRGRNHMALKVGDSHLHCHHSTTYRSKKAERALIMPPRHSTDYCLQITSHKDDEYFELYETSVARYSD,mginger1,1.16,637,587,58000,,106.0,default,7.9,0.02,mginger1_default,b,,AQ2DU
m,10.1073/pnas.1807449115,MK040730,,mGinger2,,MLLKENMHIRMYMEGTVNGHYFKCKGVGDGNPFAGTQSMRVHVTEGAPLPFAFDILAPCCEYGSKTFVRYPADIPDFFKQSFPEGFTWERTTTYEDGGILTAHQDTSLEGNCLIYKVEVHGTNFPADGPVMKKETCGWEPSTESVYPENGVLRGRNHMALKVGDSHLHCHHSTTYRSKKAERALIMPPRHSTDYCLQITSRKDDEYFELHETSVARYSD,mginger2,1.44,631,578,36000,,78.0,default,6.5,0.04,mginger2_default,b,,GSP4M
m,10.1016/j.chembiol.2009.10.009,,,mGrape1,,MASSEDVIKEFMRFKVRMEGSVNGHEFEIEGEGEGRPYEGTQTAKLKVTKGGPLPFAWDILSPQFMYGSKAYVKHPADIPDYLKLSFPEGFKWERVMNFEDGGVVTVTQDSSLQDGEFIYKVKLRGTNFPSDGPVMQKKTMGWEASSERLYPEDGALKGEIKMRLKLKDGGHYDAEAKTTYMAKKPVQLPGAYKLDYKLDITSHNEDYTIVEQYERAEGRHSTGA,mgrape1,1.5,625,595,50000,,70.0,default,4.5,0.03,mgrape1_default,b,,AL871
m,10.1371/journal.pone.0148749,,,mNeptune681,,MVSKGEELIKENMHMKLYMEGTVNNHHFKCTSEGEGKPYEGTQTQRIKVVEGGPLPFAFDILATCFMYGSKTFINHTQGIPDFFKQSFPEGFTWERVTTYEDGGVLTATQDTSLQDGCLIYNVKIRGVNFPSNGPVMQKKTLGWEANTETLYPADGGLRGHNQMALKLVGGGHLICNLKTTYRSKKPAKNLKMPGVYFVDRRLERIKEADKETYVEQHEVAVARYCDLPSKLGHKLNGMDELYK,mneptune681,1.52,681,604,38000,,,default,7.3,0.04,mneptune681_default,b,,REVUQ
m,10.1073/pnas.1013910107,,,mRojoA,3NEZ,MVSKGEEDNMAIIKEFMRFKTHMEGSVNGHEFEIEGEGEGRPYEGTQTAKLKVTKGGPLPFAWDILSPQFMYGSKAYVKHPADIPDYLKLSFPEGFKWERVMNFEDGGVVTVTQDSSLQDGEFIYKVKLHGTNFPSDGPVMQKKTMGWEASSERMYPEDGALKGEIKLRLKLKDGGHYDAEVKTTYKAKKPVQLPGAYNANYKLDITSHNEDYTIVEQYERCEGRHSTGGMDELYK,mrojoa,0.96,633,597,48000,,,default,5.4,0.02,mrojoa_default,b,,QEO8D
m,10.1073/pnas.1013910107,,,mRouge,3NED,MVSKGEEDNMAIIKEFMRFKTHMEGSVNGHEFEIEGEGEGRPYEGTQTAKLKVTKGGPLPFAWDILSPQFMYGSKAYVKHPADIPDYLKLSFPEGFKWERVMNFEDGGVVTVTQDSSLQDGEFIYKVKLRGTNFPSDGPVMQKKTMGWEACSERMYPEDGALKGEMKMRLKLKDGGHYDAEVKTTYKAKKPVQLPGAYNTNTKLDITSHNEDYTIVEQYERNEGRHSTGGMDELYK,mrouge,0.86,637,600,43000,,,default,6.1,0.02,mrouge_default,b,,JXVU8
m,10.1371/journal.pone.0041028,,,mRtms5,,MSVIATQMTYKVYMSGTVNGHYFEVEGDGKGRPYEGEQTAKLTVTKGGPLPFAWDILSPQCQYGSIPFTKYPEDIPDYVKQSFPEGFTWERIMNFEDGAVCTVSNDSSIQGNCFTYHVKFRGLNFPPNGPVMQKKTQGWEPHSERLFARGGMLIGNNRMALKLEGGGHYLCEFKTTYKAKKPVKMPGYHYVDRKLDVTNHNKDYTSVEQCEISIARKPVVA,mrtms5,0.27,633,588,54100,,,default,,0.005,mrtms5_default,b,,FD244
m,10.1371/journal.pone.0171257,,,RDSmCherry0.2,,MVSKGEEDNMAIIKEFMRFKVHMEGSVNGHEFEIEGEGEGRPYEGTQTAKLKVTKGGPLPFAWDILSPQFMYGSKAYVKHPADIPDYLKLSFPEGFKWERVMNFEDGGVVTVTQDSSLQDGEFIYKVKLRGTNFPSDGPVMQKKTMGWEASSERMYPEDGALKGEGKGRLKLKDGGHYDAEVKTTYKAKKPVQLPGAYNCNYKLDITSHNEDYTIVEQYERAEGRHSTGGMDELYK,rdsmcherry02,1.03,630,600,34400,,,default,,0.03,rdsmcherry02_default,b,,XOVUP
m,10.1371/journal.pone.0041028,,,Ultramarine,,MSVIATQMTYKVYMSGTVNGHYFEVEGDGKGRPYEGEQTAKLTVTKGGPLPFAWDILSPQCQYGSIPFTKYPEDIPDYVKQSFPEGFTWERIMNFEDGAVCTVSNDSSIQGNCFTYHVKFRGTNFPPNGPVMQKKTQGWEPNSERLFARGGMLIGNNRMALKLEGGGHYLCEFKTTYKAKKPVKMPGYHYVDRKLDVTNHNKDYTSVEQCEISIARKPVVA,ultramarine,0.06,626,586,64000,1.6,108.0,default,,0.001,ultramarine_default,b,,3F18R
