agg,doi,genbank,ipg_id,name,pdb,pdb.0,seq,slug,states.0.brightness,states.0.em_max,states.0.ex_max,states.0.ext_coeff,states.0.lifetime,states.0.maturation,states.0.name,states.0.pka,states.0.qy,states.0.slug,states.1.brightness,states.1.em_max,states.1.ex_max,states.1.ext_coeff,states.1.lifetime,states.1.maturation,states.1.name,states.1.pka,states.1.qy,states.1.slug,switch_type,transitions.0.from_state,transitions.0.to_state,transitions.0.trans_wave,uniprot,uuid
,10.1021/ja3073337,,,A44-KR,,4B30,MEGGPALFQSDMTFKIFIDGEVNGQKFTIVADGSSKFPHGDFNAHAVCETGKLPMSWKPICHLIQYGEPFFARYPDGISHFAQECFPEGLSIDRTVRFENDGTMTSHHTYELDDTCVVSRITVNCDGFQPDGPIMRDQLVDILPNETHMFPHGPNAVRQLAFIGFTTADGGLMMGHFDSKMTFNGSRAIEIPGPHFVTIITKQMRDTSDKRDHVCQREVAYAHSVPRITSAIGSDED,a44-kr,,520,397,,,,default,,,a44-kr_default,,,,,,,,,,,b,,,,,D77WT
d,10.1101/677344,,,AausGFP,,,MKIYCEGEKLFKGIVPIQIELNGDVNGHKFSVHGEGQGEAEMGRLTLRFVCTTGKMPVPWPTLVTTFSYGVQCFSRYPEHMKMHDFFKSAMPEGYTQERTIFFDKDGTYKTRAEVKFEGDTLVNRIELTGTGFKEDGNILGHKMEYNYNSHNVYIMSDKAKNGIKVNFKIRHNIEDGTVQLADHYQANYPLGKGPVLLPEDHYLSTQSALTKDPHETRDHMLLLEFVTAAGITHGMDELYK,aausgfp,21.17,503,398,29000,,,default,4.8,0.73,aausgfp_default,,,,,,,,,,,b,,,,,D7QYG
m,10.1074/jbc.m109.092320,,,aceGFP-G222E-Y220L,,,MSKGAELFTGIVPILIELNGDVNGHKFSVSGEGEGDATYGKLTLKFICTTGKLPVPWPTLVTTLSYGVQCFSRYPDHMKQHDFFKSAMPEGYIQERTIFFEDDGNYKSRAEVKFEGDTLVNRIELTGTDFKEDGNILGNKMEYNYNAHNVYIMTDKAKNGIKVNFKIRHNIEDGSVQLADHYQQNTPIGDGPVLLPDNHYLSTQSALSKDPNEKRDHMILFEFVTAAAITHGMDELYK,acegfp-g222e-y220l,,508,396,,,,default,,,acegfp-g222e-y220l_default,,,,,,,,,,,b,,,,,DH5VX
,10.1042/bj20021966,AAP69597,1780523,aceGFP-h,,,SKGAELFTGIVPILIELNGDVNGHKFSVSGEGEGDATYGKLTLKFICTTGKLPVPWPTLVTTLSYGVQCFSRYPDHMKQHDFFKSAMPEGYIQERTIFFEDDGNYKSRAEVKFEGDTLVNRIELTGTDFKEDGNILGNKMEYNYNAHNVYIMTDKAKNGIKVNFKIRHNIEDGSVQLADHYQQNTPIGDGPVLLPDNHYLSTQSALSKDPNEKRDHMIYFGFVTAAAITHGMDELYK,acegfp-h,,505,390,,,,default,,,acegfp-h_default,,,,,,,,,,,b,,,,,WBLSA
d,10.1038/nbt0396-315,,,&alpha;GFP,,,MSKGEELFTGVVPILVELDGDVNGHKFSVSGEGEGDATYGKLTLKFICTTGKLPVPWPTLVTTFSYGVQCFSRYPDHMKRHDFFKSAMPEGYVQERTISFKDDGNYKTRAEVKFEGDTLVNRIELKGIDFKEDGNILGHKLEYNYNSHNVYITADKQKNGIKANFKIRHNIEDGSVQLADHYQQNTPIGDGPVLLPDNHYLSTQSALSKDPNEKRDHMVLLEFVTAAGITHGMDELYK,alphagfp,23.7,506,397,30000,,,default,,0.79,alphagfp_default,,,,,,,,,,,b,,,,,B28N7
t,10.3354/meps07588,ACH89426,15616240,amilFP484,,,MSYSKQGIVQEMKTKYHMEGSVNGHEFTIEGVGTGNPYEGTQMSELVITKPAGKPLPFSFDILSTVFQYGNRCFTKYPEGMTDYFKQAFPDGMSYERSFLYEDGGVATASWNIRLERDCFIHKSIYHGVNFPADGPVMKKKTIGWDKAFEKMTVSKDVLRGDVTEFLMLEGGGYHSCQFHSTYKPEKPVTLPPNHVVEHHIVRTDLGQRAKGFTVKLEEHAAAHVNPLKVK,amilfp484,,484,420,,,,default,,,amilfp484_default,,,,,,,,,,,b,,,,B5T1L2,9MM4N
,10.1002/jemt.20410,AAU06849,3620749,amilFP490,,,MSYSKQGIAQVMKTKYHMEGSVNGHEFTIEGVGTGNPYEGTQMSELVITKPAGKPLPFSFDILSTVFQYGNRCFTKYPEGMTDYFKQAFPDGMSFERSFLYEDGGVATASWNIRLERDCFIHKSIYHGVNFPADGPVMKKKTIGWDKAFEKMTVSKDVLRGDVTEFLMLEGGGYHSCQFHSTYKPEKPVTLPPNHVVEHHIVRTDLGQTAKGFTVKLEEHAAAHVNPLKVQ,amilfp490,26.55,490,424,29500,,,default,,0.9,amilfp490_default,,,,,,,,,,,b,,,,Q66PV5,VAXZZ
t,10.3354/meps07588,ACH89424,15616238,apulFP483,,,MSYSKQGIVQVMKTKYHMEGSVNGHEFTIEGVGTGNPYEGTQMSELVITKPAGKPLPFSFDILSTVFQYGNRCFTKYPEGMTDYFKQAFPDGMSYERSFLYEDGGVATASWNIRLERDCFIHKSIYHGVNFPADGPVMKKKTIGWDKAFEKMTVSKDVLRGDVTEFLMLEGGGYHSCQFHSTYKPEKPAALPPNHVVEHHIVRTDLGQSAKGFTVKLEEHAAAHVNPLKVK,apulfp483,,483,420,,,,default,,,apulfp483_default,,,,,,,,,,,b,,,,B5T1L0,VAPCK
d,10.1016/0378-1119(92)90691-h,AAA27721,1266562,avGFP,,1GFL,MSKGEELFTGVVPILVELDGDVNGHKFSVSGEGEGDATYGKLTLKFICTTGKLPVPWPTLVTTFSYGVQCFSRYPDHMKQHDFFKSAMPEGYVQERTIFFKDDGNYKTRAEVKFEGDTLVNRIELKGIDFKEDGNILGHKLEYNYNSHNVYIMADKQKNGIKVNFKIRHNIEDGSVQLADHYQQNTPIGDGPVLLPDNHYLSTQSALSKDPNEKRDHMVLLEFVTAAGITHGMDELYK,avgfp,19.75,509,395,25000,,,default,4.5,0.79,avgfp_default,,,,,,,,,,,b,,,,P42212,1XF1B
,10.1016/j.bbrc.2005.04.166,,,avGFP454,,,MSKGEELFTGVVPILVELDGDVNGHKFSVSGEGEGDATYGKLTLKFICTTGKLPVPWPTLVTTFSYAVQCFSRYPDHMKQHDFFKSAMPEGYVQERTIFFKDDGNYKTRAEVKFEGDTLVNRIELKGIDFKEDGNILGHKLEYNYNSHNVYIMADKQKNGIKVNFKIRHNIEDGSVQLADHYQQNTPIGDGPVLLPDNHYLSTQSALSKDPNEKRDHMVLLEFVTAAGITHGMDELYK,avgfp454,,454,410,,,,default,,,avgfp454_default,,,,,,,,,,,b,,,,,T4B2J
,10.1016/0378-1119(95)00768-7,,,BFP5,,,MSKGEELFTGVVPILVELDGDVNGHKFSVSGEGEGDATYGKLTLKFICTTGKLPVPWPTLVTTMSHGIQCFSRYPDHMKQHDFFKSAMPEGYVQERTIFFKDDGNYKTRAEVKFEGDTLVNRIELKGIDFKEDGNILGHKLEYNYNSHNVYIMADKQKNGIKVNFKIRHNIEDGSVQLADHYQQNTPIGDGPVLLPDNHYLSTQSALSKDPNEKRDHMVLLEFVTAAGITHGMDELYK,bfp5,,450,385,,,,default,,,bfp5_default,,,,,,,,,,,b,,,,,RSDF7
,10.1073/pnas.062552299,AAK71342,90243,cgigGFP,,,MYPWIKETMRSKVYMEGDVNNHAFKCTAVGEGKPYKGSQDLTITVTEGGPLPFAFDILSHAFQYGNKVFTDYPDDIPDFFKQSLSDGFTWRRVSXYXXGGVLTVTQDTSLKGDCIICNIKVHGTNFPENGPVMQNKTDGWEPSSTETVIPQDGGIVAARSPALRLRDKGHLICHMETTYKPNKEVKLPELHFHHLRMEKLSVSDDGKTIKQHEYVVASYSKVPSKIGRQ,cgiggfp,,496,399,,,,default,,,cgiggfp_default,,,,,,,,,,,b,,,,Q8T5E7,UHFA9
,10.1186/1472-6750-3-5,,,cpT-Sapphire 174-173,,,,cpt-sapphire-174-173,23.32,511,399,44000,,,default,5.2,0.53,cpt-sapphire-174-173_default,,,,,,,,,,,b,,,,,AJWMF
m,10.1126/science.1168683,AE001825,AAF12261.1,DrCBD,,1ztu,MSRDPLPFFPPLYLGGPEITTENCEREPIHIPGSIQPHGALLTADGHSGEVLQMSLNAATFLGQEPTVLRGQTLAALLPEQWPALQAALPPGCPDALQYRATLDWPAAGHLSLTVHRVGELLILEFEPTEAWDSTGPHALRNAMFALESAPNLRALAEVATQTVRELTGFDRVMLYKFAPDATGEVIAEARREGLHAFLGHRFPASDIPAQARALYTRHLLRLTADTRAAAVPLDPVLNPQTNAPTPLGGAVLRATSPMHMQYLRNMGVGSSLSVSVVVGGQLWGLIACHHQTPYVLPPDLRTTLEYLGRLLSLQVQVKEA,drcbd,,622,416,,,,default,,,drcbd_default,,,,,,,,,,,b,,,,Q9RZA4,Y2WTN
,10.1002/anie.201204962,,,GFP-Tyr151pyz,,4GES,MSKGEALFTGVVPILVELDGDVNGHKFSVSGEGEGDATYGKLTLKFICTTGKLPVPWPTLVTTFSYGVQCFSRYPDHMKQHDFFKSAMPEGYVQERTISFKDDGNYKTRAEVKFEGDTLVNRIELKGIDFKEDGNILGHKLEYNYNSHNVYITADKQKNGIKANFKIRHNIEDGSVQLADHYQQNTPIGDGPVLLPDNHYLSTQSALSKDPNEKRDHMVLLEFVTAAGITHGMDELYK,gfp-tyr151pyz,,508,397,,,,default,,,gfp-tyr151pyz_default,,,,,,,,,,,b,,,,,GBEZ4
m,10.1007/s10126-006-6006-8,,,GFPxm181uv,,,MSKGEELFTGIVPVLIELDGDVHGHKFSVRGEGEGDADYGKLEIKFICTTGKLPVPWPTLVTTLSYGIQCFARYPEHMKMNDFFKSAMPEGYIQERTIFFQDDGKYKTRGEVKFEGDTLVNRIELKGMDFKEDGNILGHKLEYNFNSHNVYIMPDKANNGLKVNFKIRHNIEGGGVQLADHYQTNVPLGDGPVLIPINHYLSHQTAISKDRNETRDHMVLLEFFSACGHTHGMDELYK,gfpxm181uv,,514,398,,,,default,,,gfpxm181uv_default,,,,,,,,,,,b,,,,,KCUBM
m,10.1007/s10126-006-6006-8,,,GFPxm18uv,,,MSKGEELFTGIVPVLIELDGDVHGHKFSVRGEGEGDADYGKLEIKFICTTGKLPVPWPTLVTTLGYGIQCFARYPEHMKMNDFFKSAMPEGYIQERTIFFQDDGKYKTRGEVKFEGDTLVNRIELKGMDFKEDGNILGHKLEYNFNSHNVYIMPDKANNGLKVNFKIRHNIEGGGVQLADHYQTNVPLGDGPVLIPINHYLSHQTAISKDRNETRDHMVFLEFFSACGHTHGMDELYK,gfpxm18uv,,513,400,,,,default,,,gfpxm18uv_default,,,,,,,,,,,b,,,,,4YUEY
m,10.1007/s10126-006-6006-8,AAL33916,376227,GFPxm19uv,,,MSKGEELFTGIVPVLIELDGDVHGHKFSVRGEGEGDADYGKLEIKFICTTGKLPVPWPTLVTTLSYGIQCFARYPEHMKMNDFFKSAMPEGYIQERTIFFQDDGKYKTRGEVKFEGDTLVNRIELKGMDFKEDGNILGHKLEYNFNSHNVYIMPDKANNGLKVNFKIRHNIEGGGVQLADHYQTNVPLGDGPVLIPINHYLSTQTAISKDRNETRDHMVFLEFFSACGHTHGMDELYK,gfpxm19uv,,505,393,,,,default,,,gfpxm19uv_default,,,,,,,,,,,b,,,,Q8WTC6,XAQPR
,10.1073/pnas.91.26.12501,,,H9,,,MSKGEELFTGVVPILVELDGDVNGHKFSVSGEGEGDATYGKLTLKFICTTGKLPVPWPTLVTTFSYGVQCFSRYPDHMKQHDFFKSAMPEGYVQERTIFFKDDGNYKTRAEVKFEGDTLVNRIELKGIDFKEDGNILGHKLEYNYNSHNVYIMADKQKNGIKVNFKIRHNIEDGSVQLADHYQQNTPIGDGPVLLPDNHYLFIQSALSKDPNEKRDHMVLLEFVTAAGITHGMDELYK,h9,12.0,511,399,20000,,,default,,0.6,h9_default,,,,,,,,,,,b,,,,,59R1F
,10.1073/pnas.062552299,AAM10626,3493082,hcriGFP,,,MCSYIKETMQSKVYMEGKVNDHNFKCTAEGKGEPYKGSQSLTITVTEGGPLPFAFDILSHAFRYGNKVFAKYPKDHPDFFKQSLPEGFTWERVSNYEDGGVLTVKQETSLEGDCIICKIKAHGTNFPADGPVMQKRTNGWEPSTETVIPRGGGILMRDVPALKLLGNKGHLLCVMETTYKSKKKVNLPKPHFHHLRMEKDSVSDDEKTIEQHENVRASYFNDSGK,hcrigfp,,500,405,,,,default,,,hcrigfp_default,,,,,,,,,,,b,,,,Q8T6T9,C5398
,10.1101/2022.10.11.511732,,,htFuncLib_photostable.1,,,MGSSHHHHHHVSKGEELFTGVVPILVELDGDVNGHKFSVRGEGEGDATYGKLTLKFICTTGKLPVPWPTLATTLSYGAQCFCRYPDHMKQHDFFKSAMPEGYVQERTIFFKDDGCYKTRAEVKFEGDTLVNRIELHGIDFKEDGNILGHKLEYNMNSHNIYIMPDKQNNGIKVNFKVRHNIEDGSVQLADHYQQNTPIGDGPVLLPDYHYLHTWSELSKDPNEKRDHMVLLEFVEAAGITLGMDELYK,htfunclib_photostable1,,505,394,,1.0,,default,5.23,0.0,htfunclib_photostable1_default,,,,,,,,,,,b,,,,,K5XCR
,10.1101/2022.10.11.511732,,,htFuncLib_slow.4,,,MGSSHHHHHHVSKGEELFTGVVPILVELDGDVNGHKFSVSGEGEGDATYGKLTLKFICTTGKLPVPWPTLVTTLTYGVQCFSRYPDHMKQHDFFKSAMPEGYVQERTIFFKDDGCYKTRAEVKFEGDTLVNRIELHGIDFKEDGNILGHKLEYNFNSHNVYIMPDKQNNGIKMNFKTRHNIEDGSVQLADHYQENTPIGDGPVLLPDYHYLHHWDELSKDPNEKRDHMVLLEFVEAAGITLGMDELYK,htfunclib_slow4,,509,393,,1.32,,default,4.29,0.29,htfunclib_slow4_default,,,,,,,,,,,b,,,,,VGWZK
,10.1101/2022.10.11.511732,,,htFuncLib_thermo.4,,,MGSSHHHHHHVSKGEELFTGVVPILVELDGDVNGHKFSVSGEGEGDATYGKLTLKFICTTGKLPVPWPTLVTTLTYGVMCFSRYPDHMKQHDFFKSAMPEGYVQERTIFFKDDGCYKTRAEVKFEGDTLVNRIELHGIDFKEDGNILGHKLEYNFNSHNVYIMPDKQNNGIKANFKVRHNIEDGSVQLADHYQQNTPIGDGPVLLPDYHYLHHWDELSKDPNEKRDHMVLLEFVEAAGITLGMDELYK,htfunclib_thermo4,,507,396,,1.14,,default,4.21,0.19,htfunclib_thermo4_default,,,,,,,,,,,b,,,,,UJG2E
,10.1101/2022.10.11.511732,,,htFuncLib_thermo.5,,,MGSSHHHHHHVSKGEELFTGVVPILIELDGDVNGHKFSVRGEGEGDATYGKLTLKFICTTGKLPVPWPTLATTLSYGVQCFARYPDHMKQHDFFKSAMPEGYVQERTIFFKDDGCYKTRAEVKFEGDTLVNRIELHGIDFKEDGNILGHKLEYNMNSHNVYIMPDKQNNGIKVNFKIRHNIEDGSVQLADHYQRNTPIGDGPVLLPDYHYLHTWSELSKDPNEKRDHMVVLEFIEAAGITLGMDELYK,htfunclib_thermo5,,510,397,,1.06,,default,3.68,0.66,htfunclib_thermo5_default,,,,,,,,,,,b,,,,,6UXG3
,10.1101/2022.10.11.511732,,,htFuncLib_thermo.6,,,MGSSHHHHHHVSKGEELFTGVVPILIELDGDVNGHKFSVRGEGEGDATYGKLTLKFICTTGKLPVPWPTLATTLSYGVQCFARYPDHMKQHDFFKSAMPEGYVQERTIFFKDDGCYKTRAEVKFEGDTLVNRIELHGIDFKEDGNILGHKLEYNMNSHNVYIMPDKQNNGIKVNFKIRHNIEDGSVQLADHYQQNTPIGDGPVLLPDYHYLHTWSELSKDPNEKRDHMVVLEFIEAAGITLGMDELYK,htfunclib_thermo6,,510,398,,1.08,,default,3.72,0.72,htfunclib_thermo6_default,,,,,,,,,,,b,,,,,RC341
,10.1101/2022.10.11.511732,,,htFuncLib_thermo.8,,,MGSSHHHHHHVSKGEELFTGVVPILVELDGDVNGHKFSVRGEGEGDATYGKLTLKFICTTGKLPVPWPTLVTTLSYGVQCFCRYPDHMKQHDFFKSAMPEGYVQERTIFFKDDGCYKTRAEVKFEGDTLVNRIELHGIDFKEDGNILGHKLEYNINSHNVYIMPDKQNNGIKVNFKIRHNIEDGSVQLADHYQQNTPIGDGPVLLPDYHYLHTWSELSKDPNEKRDHMVLLEFIEAAGITLGMDELYK,htfunclib_thermo8,,510,400,,0.96,,default,4.57,0.73,htfunclib_thermo8_default,,,,,,,,,,,b,,,,,C4C4B
m,10.1371/journal.pone.0095808,,,iq-EBFP2,,,,iq-ebfp2,15.62,446,386,24800,,,default,,0.63,iq-ebfp2_default,,,,,,,,,,,b,,,,,QXJO4
m,10.1038/nmeth.1207,ABW74903,13918900,mAmetrine,,,MVSKGEELFTGVVPILVELDGDVNGHKFSVRGEGEGDATNGKLTLKFICTSGKLPVPWPTLVTTLSYGVQCFARYPDHMKQHDFFKSAMPEGYVQERTISFKDDGSYRTRAEVKFEGDTLVNRIELKGIDFKEDGNILGHKLEYNMNVWDAYITADKQKNGIKANFKIEHNVEDGGVQLADAYQQNTPIGDGSVLLPDNHYLSFQSKLFKDPNEQRDHMVLLEFVTAAGITPGMDELYK,mametrine,26.1,526,406,45000,,1.8,default,6.0,0.58,mametrine_default,,,,,,,,,,,b,,,,,DF1S4
m,10.1021/bi700199g,,,mBlueberry1,,,MVSKGEEDNMAIIKEFMRFKVHMEGSVNGHEFEIEGEGEGRPYEGTQTAKLKVTKGGPLPFAWDILSPQFLFGSRAYVKHPADIPDYLKLSFPEGFKWERVMNFEDGGVVTVTQDSSLQDGEFIYKVKLRGTNFPSDGPVMRRKTMGWEASSERMCPEDGALKGEIKLRLKLRDGGHYDAEVKTTYKAKKPVQLPGAYNVNIKLDITSHNEDYTIVEQYERAEGRHSTGGMDELYK,mblueberry1,5.28,452,398,11000,,,default,,0.48,mblueberry1_default,,,,,,,,,,,b,,,,,WNJAS
m,10.1021/bi700199g,ABP88742,12966091,mKalama1,,,MVSKGEELFTGVVPILVEMDGDVNGRKFSVRGVGEGDATHGKLTLKFICTSGKLPVPWPTLVTTLSYGVQCFSRYPDHMKQHDFFKSAMPEGYVQERTIFFKDDGSYKTRAEVKFEGDTLVNRIVLKGTDFKEDGNILGHKLEYNMNVGNVYITADKQKNGIKANFEIRHNVEDGGVQLADHYQQNTPIGDGSVLLPDNHYLSVQVKLSKDPNEKRDHMVLLEFRTAAGITPGMDELYK,mkalama1,16.2,456,385,36000,,,default,5.5,0.45,mkalama1_default,,,,,,,,,,,b,,,,,TUONH
m,10.1016/j.febslet.2004.06.043,AAO00732,938781,mmGFP,,,MAVPTQVKMKYSMDGNFNGQSFTVVGEGTGNPYEGHQSLKLTVKGEPLPFAFDILSATFTYGNRVFTKYPEGKTDYFKEAFPGGLTWERTMTFEDGGICTVAAEISLTGSVFEHKSKFVGVNFPANGPVIQKKTLGWETSTEKMAANDGSVQGYDTMFLKLEGGGRHKCYFVTNHKAKRAVKVPDNHFVWHRLVRNGDGNTVELEETAEARYDS,mmgfp,,505,398,,3.1,1440.0,default,,0.645,mmgfp_default,,,,,,,,,,,b,,,,Q86LV8,U5ALR
t,10.1371/journal.pone.0002680,ABB17965,4901536,mmilCFP,,,MALPKQMKLTYHMEGTVNGHFFIIKGEGGGEPYEGTHTIKLQVVEGSPLPFSPDILSTVFQYGNRCFTKYPPNIVDYFKNSCSGGGYTFGRSFLYEDGAVCTASGDITLSSDKSSFEHKSKFLGVNFPADGPVMKKETTNWEPSCEKMTPNGMTLIGDVTEFLLKKDGKRYKCQFHTFHDAKEKSRNMPMPDFHFVQHEIERKDLPGPMQTWQLTEHAAACKNCFTE,mmilcfp,38.25,492,404,42500,,,default,,0.9,mmilcfp_default,,,,,,,,,,,b,,,,A8CLU7,QB1DP
m,10.1038/ncomms8670,,,moxBFP,,,MVSKGEELFTGVVPILVELDGDVNGHKFSVRGEGEGDATNGKLTLKFISTTGKLPVPWPTLVTTLSHGVQVFARYPDHMKQHDFFKSAMPEGYVQERTIFFKDDGTYKTRAEVKFEGDTLVNRIELKGVDFKEDGNILGHKLEYNFNSHNIYIMAVKQKNGIKANFKIRHNVEDGSVQLADHYQQNTPIGDGPVLLPDSHYLSTQSKLSKDPNEKRDHMVLLEFRTAAGITLGMDELYK,moxbfp,17.36,448,385,31000,,,default,,0.56,moxbfp_default,,,,,,,,,,,b,,,,,SSTDU
m,10.1371/journal.pone.0028674,,,mTagBFP2,,,MVSKGEELIKENMHMKLYMEGTVDNHHFKCTSEGEGKPYEGTQTMRIKVVEGGPLPFAFDILATSFLYGSKTFINHTQGIPDFFKQSFPEGFTWERVTTYEDGGVLTATQDTSLQDGCLIYNVKIRGVNFTSNGPVMQKKTLGWEAFTETLYPADGGLEGRNDMALKLVGGSHLIANAKTTYRSKKPAKNLKMPGVYYVDYRLERIKEANNETYVEQHEVAVARYCDLPSKLGHKLN,mtagbfp2,32.38,454,399,50600,2.6,12.0,default,2.7,0.64,mtagbfp2_default,,,,,,,,,,,b,,,,,ZO7NN
m,10.1186/1741-7007-6-13,,,mTFP1-Y67W,,,MVSKGEETTMGVIKPDMKIKLKMEGNVNGHAFVIEGEGEGKPYDGTNTINLEVKEGAPLPFSYDILTTAFAWGNRAFTKYPDDIPNYFKQSFPEGYSWERTMTFEDKGIVKVKSDISMEEDSFIYEIHLKGENFPPNGPVMQKKTTGWDASTERMYVRDGVLKGDVKHKLLLEGGGHHRVDFKTIYRAKKAVKLPDYHFVDHRIEILNHDKDYNKVTVYESAVARNSTDGMDELYK,mtfp1-y67w,0.06,461,424,3000,,,default,,0.02,mtfp1-y67w_default,,,,,,,,,,,b,,,,,4JYN3
,10.1039/c1pp05068k,AEL17649,24262672,obeCFP,,,MSSAGALLFTNKIPYVTELEGDVNGMKFTIHGKGTGDASTGNIEAKYVCTSGEIPVPWATLVSTLSYGVQCFAKYPSHIKDFFKSAMPEGYTQERTISFEGDGVYKTRAMVTYERGSIYNRVTLTGENFKKDGHILRKNVAFQCPPDMVYILPDTVNNGIRVEFNQAYDIEGVTEKLVTKCSQMNRPLAGSAAVHIPRYHHLSKHTKLSKDRDERRDHMCLVEVVKAVDLDTYQ,obecfp,22.32,499,400,36000,,,default,,0.62,obecfp_default,,,,,,,,,,,b,,,,G1JSF2,JGCGO
d,10.1038/ncomms8670,,,oxBFP,,,MVSKGEELFTGVVPILVELDGDVNGHKFSVRGEGEGDATNGKLTLKFISTTGKLPVPWPTLVTTLSHGVQVFARYPDHMKQHDFFKSAMPEGYVQERTIFFKDDGTYKTRAEVKFEGDTLVNRIELKGVDFKEDGNILGHKLEYNFNSHNIYIMAVKQKNGIKANFKIRHNVEDGSVQLADHYQQNTPIGDGPVLLPDSHYLSTQSVLSKDPNEKRDHMVLLEFRTAAGITLGMDELYK,oxbfp,17.36,448,385,31000,,,default,,0.56,oxbfp_default,,,,,,,,,,,b,,,,,QX7D1
,10.4236/abb.2011.23021,,,pHluorin2,,,MSKGEELFTGVVPILVELDGDVNGHKFSVSGEGEGDATYGKLTLKFICTTGKLPVPWPTLVTTLSYGVQCFSRYPDHMKQHDFFKSAMPEGYVQERTIFFKDDGNYKTRAEVKFEGDTLVNRIELKGIDFKDDGNILGHKLEYNYNEHLVYIMADKQKNGIKVIFQVHHNIEDGSVQLADHYQQNTPIGDGPVLLPDNHYLHTQSALSKDPNEKRDHMVFLEFVTAAGITHGMDELYK,phluorin2,,509,475,,,,acidic,,,phluorin2_acidic,,509,395,,,,alkaline,,,phluorin2_alkaline,o,,,,,SJT6S
,10.1038/28190,AAC40226,,"pHluorin, ecliptic",,,MSKGEELFTGVVPILVELDGDVNGHKFSVSGEGEGDATYGKLTLKFICTTGKLPVPWPTLVTTFSYGVQCFSRYPDHMKRHDFFKSAMPEGYVQERTIFFKDDGNYKTRAEVKFEGDTLVNRIELKGIDFKEDGNILGHKLEYNYNDHQVYIMADKQKNGIKANFKIRHNIEDGGVQLADHYQQNTPIGDGPVLLPDNHYLFTTSTLSKDPNEKRDHMVLLEFVTAAGITHGMDELYK,phluorin-ecliptic,,509,395,,,,acidic,,,phluorin-ecliptic_acidic,,509,395,,,,default,7.1,,phluorin-ecliptic_default,o,,,,,KPFB9
,10.1038/28190,AAC40225,,"pHluorin, ratiometric",,,MSKGEELFTGVVPILVELDGDVNGHKFSVSGEGEGDATYGKLTLKFICTTGKLPVPWPTLVTTFSYGVQCFSRYPDHMKRHDFFKSAMPEGYVQERTIFFKDDGNYKTRAEVKFEGDTLVNRIELKGIDFKDDGNILGHKLEYNYNEHLVYIMADKQKNGTKAIFQVHHNIEDGGVQLADHYQQNTPIGDGPVLLPDNHYLHTQSALSKDPNEKRDHMVLLEFVTAAGITHGMDELYK,phluorin-ratiometric,,509,475,,,,acidic,,,phluorin-ratiometric_acidic,,509,395,,,,alkaline,,,phluorin-ratiometric_alkaline,o,,,,,XKELZ
t,10.1371/journal.pone.0002680,ACD13191,14926072,psamCFP,,,MASTKNVLPNMMTLTYHMEGSVNGHNFEIIGEGTGNPKEGKHTITLQVVKGGPLPFSVDILSTVFQYGNRCFTKYPPNTVDYFKNSCPPGYTFERSFLYEDGAVCTASGDITLSDDKASFHHKSKFFGVNFPDDGPVMKKKTTDWEPSCEKMTPSGKTLKGDVIEFLLLEGGGRYKCQFHTVYRAKTEPKRMPEFHFVQHKLTRTDVSDPLKQQWQLTEDAAACESCFHK,psamcfp,29.57,492,404,30800,,,default,,0.96,psamcfp_default,,,,,,,,,,,b,,,,B6CTZ2,U69HK
m,,,,PS-CFP2,,,MSKGAELFTGIVPILIELNGDVNGHKFSVSGEGEGDATYGKLTLKFICTTGKLPVPWPTLVATLSYGVQCFSRYPDHMKQHDFFKSAMPEGYIQERTIFFEDDGNYKTRAEVKFEGDTLVSRIELTGTDFKEDGNILGNKMEYNYNATNVYIVADKARNGIKVNFKVRHNIKDGSVQLADHYQQNTPIGDGPVLLPDNHYLSTQSALSKDPNEKRDHMIYLEFVTAAAITHGMDELYK,ps-cfp2,8.6,468,400,43000,,,Cyan,,0.2,ps-cfp2_cyan,10.81,511,490,47000,,,Green,,0.23,ps-cfp2_green,pc,ps-cfp2_cyan,ps-cfp2_green,405,,RDRFL
,10.1074/jbc.m312846200,,,roGFP1-R1,,2AH8,MSKGEELFTGVVPILVELDGDVNGHKFSVSGEGEGDATYGKLTLKFISTTGKLPVPWPTLVTTFSYGVQCFSRYPDHMKRHDFFKSAMPEGYVQERTIFFKDDGNYKTRAEVKFEGDTLVNRIELKGIDFKEDGNILGHKLEYNYNCHNVYIMADKQKNGIKVNFKIRHNIEDGSVQLADHYQQNTPIGDGPVLLPDNHYLKTCSALSKDPNEKRDHMVLLERVTAAGITHGMDELYK,rogfp1-r1,,508,400,,,,default,,,rogfp1-r1_default,,,,,,,,,,,b,,,,,Y8A5R
,10.1074/jbc.m312846200,,,roGFP1-R8,,2AHA,MSKGEELFTGVVPILVELDGDVNGHKFSVSGEGEGDATYGDLTLKFISTTGKLPVPWPTLVTTFSYGVQCFSRYPDHMKRHDFFKSAMPEGYVQERTIFFKDDGNYKTRAEVKFEGDTLVNRIELKGIDFKEDGNILGHKLEYNYNCHNVYIMADKQKNGIKVNFKIRHNIEDGSVQLADHYQQNTPIGDGPVLLPDNHYLSTCSALSKDPNEKRDHMVLLERVTAAGITHGMDELYK,rogfp1-r8,,511,400,,,,default,,,rogfp1-r8_default,,,,,,,,,,,b,,,,,U5JBT
wd,10.1016/s0091-679x(08)61946-9,,,Sapphire,,,MSKGEELFTGVVPILVELDGDVNGHKFSVSGEGEGDATYGKLTLKFICTTGKLPVPWPTLVTTFSYGVQCFARYPDHMKQHDFFKSAMPEGYVQERTIFFKDDGNYKTRAEVKFEGDTLVNRIELKGIDFKEDGNILGHKLEYNFNSHNVYIMADKQKNGIKVNFKIRHNIEDGSVQLADHYQQNTPIGDGPVLLPDNHYLSIQSALSKDPNEKRDHMVLLEFVTAAGITLGMDELYK,sapphire,18.56,511,399,29000,,38.4,default,4.9,0.64,sapphire_default,,,,,,,,,,,b,,,,,G4VP2
m,10.1016/j.bbrc.2012.12.028,,,secBFP2,,,MSEELIKENMHMKLYMEGTVDNHHFKATSEGEGKPYEGTQTMRIKVVEGGPLPFAFDILATSFLYGSKTFIDHTQGIPDFFKQSFPEGFTWERVTTYEDGGVLTATQDTSLQDGSLIYNVKIRGVDFTSNGPVMQKKTLGWEAFTETLYPADGGLEGRNDMALKLVGGSHLIANAKTTYRSKKPAKNLKMPGVYYVDYRLERIKEANDETYVEQHEVAVARYSDLPSKLGHKLN,secbfp2,,456,399,,,,default,,,secbfp2_default,,,,,,,,,,,b,,,,,PQRLE
,10.1038/nsb0597-361,,,sg11,,1EMC,MASKGEELFTGVVPILVELDGDVNGHKFSVSGEGEGDATYGKLTLKFICTTGKLPVPWPTLVTTLSYGVQCFSRYPDHMKRHDFFKSAMPEGYVQERTIFFKDDGNYKTRAEVKFEGDTLVNRIELKGIDFKEDGNILGHKLEYNYNSHNVYIMADKQKNGIKVNFKTRHNIEDGSVQLADHYQQNTPIGDGPVLLPDNHYLSTQSALSKDPNEKRDHMVLLEFVTAAGITHGMDELYN,sg11,10.67,506,385,12700,,,default,,0.84,sg11_default,,,,,,,,,,,b,,,,,T23T9
,10.1038/nsb0597-361,,,sg12,,1EMM,MASKGEELFTGVVPILVELDGDVNGHKFSVSGEGEGDATYGKLTLKFICTTGKLPVPWPTLVTTLSYGVQCFSRYPDHMKRHDFFKSAMPEGYVQERTIFFKDDGNYKTRAEVKFEGDTLVNRIELKGIDFKEDGNILGHKLEYNYNSHNVYIMADKQKNGIKVNFKIRHNIEDGSVQLADHYQQNTPIGDGPVLLPDNHYLSTQSALSKDPNEKRDHMVLLEFVTAAGITHGMDELYK,sg12,15.55,508,396,18300,,,default,,0.85,sg12_default,,,,,,,,,,,b,,,,,T972V
m,10.1016/j.chembiol.2008.08.006,,,TagBFP,,3M24,MSELIKENMHMKLYMEGTVDNHHFKCTSEGEGKPYEGTQTMRIKVVEGGPLPFAFDILATSFLYGSKTFINHTQGIPDFFKQSFPEGFTWERVTTYEDGGVLTATQDTSLQDGCLIYNVKIRGVNFTSNGPVMQKKTLGWEAFTETLYPADGGLEGRNDMALKLVGGSHLIANIKTTYRSKKPAKNLKMPGVYYVDYRLERIKEANNETYVEQHEVAVARYCDLPSKLGHKLN,tagbfp,32.76,457,402,52000,2.6,13.0,default,2.7,0.63,tagbfp_default,,,,,,,,,,,b,,,,,BFJKS
