agg,doi,genbank,ipg_id,name,pdb,pdb.0,pdb.1,pdb.10,pdb.2,pdb.3,pdb.4,pdb.5,pdb.6,pdb.7,pdb.8,pdb.9,seq,slug,states.0.brightness,states.0.em_max,states.0.ex_max,states.0.ext_coeff,states.0.lifetime,states.0.maturation,states.0.name,states.0.pka,states.0.qy,states.0.slug,states.1.brightness,states.1.em_max,states.1.ex_max,states.1.ext_coeff,states.1.lifetime,states.1.maturation,states.1.name,states.1.pka,states.1.qy,states.1.slug,states.2.brightness,states.2.em_max,states.2.ex_max,states.2.ext_coeff,states.2.lifetime,states.2.maturation,states.2.name,states.2.pka,states.2.qy,states.2.slug,states.3.brightness,states.3.em_max,states.3.ex_max,states.3.ext_coeff,states.3.lifetime,states.3.maturation,states.3.name,states.3.pka,states.3.qy,states.3.slug,switch_type,transitions.0.from_state,transitions.0.to_state,transitions.0.trans_wave,transitions.1.from_state,transitions.1.to_state,transitions.1.trans_wave,transitions.2.from_state,transitions.2.to_state,transitions.2.trans_wave,transitions.3.from_state,transitions.3.to_state,transitions.3.trans_wave,transitions.4.from_state,transitions.4.to_state,transitions.4.trans_wave,uniprot,uuid
t,10.1002/pro.3540,,,AdRed,,6AA7,,,,,,,,,,,MALSKHGLTKDMTMKYRMEGCVDGHKFVITGHGNGSPFEGKQTINLCVVEGGPLPFSEDILSAVFDYGNRVFTDYPQGMVDFFKNSCPAGYTWQRSLLFEDGAVCTASADITVSVEENCFYHESKFHGVNFPADGPVMKKMTINWEPCCEKIIPVPRQGILKGDVAMYLLLKDGGRYRCQFDTVYKAKTDSKKMPEWHFIQHKLTREDRSDAKNQKWQLAEHSVASRSALP,adred,,612,567,,,,default,4.0,,adred_default,,,,,,,,,,,,,,,,,,,,,,,,,,,,,,,b,,,,,,,,,,,,,,,,A0A1S7IWI8,DAH3B
,10.1002/pro.3540,,,AdRed-C148S,,,,,,,,,,,,,MALSKHGLTKDMTMKYRMEGCVDGHKFVITGHGNGSPFEGKQTINLCVVEGGPLPFSEDILSAVFDYGNRVFTDYPQGMVDFFKNSCPAGYTWQRSLLFEDGAVCTASADITVSVEENCFYHESKFHGVNFPADGPVMKKMTINWEPSCEKIIPVPRQGILKGDVAMYLLLKDGGRYRCQFDTVYKAKTDSKKMPEWHFIQHKLTREDRSDAKNQKWQLAEHSVASRSALP,adred-c148s,,599,560,,,,default,,,adred-c148s_default,,,,,,,,,,,,,,,,,,,,,,,,,,,,,,,b,,,,,,,,,,,,,,,,,THMOX
t,10.1002/jemt.20410,AAU06852,3620742,amilFP593,,,,,,,,,,,,,MALSKHGLTKDMTMKYHMEGSVDGHKFVITGHGNGNPFEGKQTMNLCVVEGGPLPFSEDILSAAFDYGNRVFTEYPQGMVDFFKNSCPAGYTWHRSLLFEDGAVCTTSADITVSVEENCFYHNSKFHGVNFPADGPVMKKMTTNWEPSCEKIIPVPRQGILKGDIAMYLLLKDGGRYRCQFDTIYKAKSDPKEMPEWHFIQHKLTREDRSDAKNQKWQLVEHAVASRSALPG,amilfp593,44.54,593,562,90900,,,default,,0.49,amilfp593_default,,,,,,,,,,,,,,,,,,,,,,,,,,,,,,,b,,,,,,,,,,,,,,,,Q66PV2,VDDDT
t,10.3354/meps07588,ACH89429,15616243,amilFP597,,,,,,,,,,,,,MALSKHGLTKDMTMKYHMEGSVDGHKFVITGHGNGNPFEGKQTVNLCVAEGGPLPFSEDILSAAFDYGNRVFTEYPQGMVDFFKNSCPAGYTWHRSLLFEDGAVCTTSADITVSVEENCFYHNSKFHGVNFPADGPVMKKMTTNWEPSCEKIIPVPRQGILKGDIAMYLLLKDGGRYRCQFDTIYKAKSDPKEMPEWHFIQHKLTREDRSDAKNQKWQLVEHAVASRSALPG,amilfp597,,597,558,,,,default,,,amilfp597_default,,,,,,,,,,,,,,,,,,,,,,,,,,,,,,,b,,,,,,,,,,,,,,,,B5T1L5,2YKB1
m,10.1093/molbev/msh079,AAR85352,1978504,anm2CP,,,,,,,,,,,,,MEGGPALFQSDMTFKIFIDGVVNDQKFTIIADGSSKFPHGDFNVHAVCETGKLPMSWKPICHLIQYGEPFFAKYPNGISHFAQECFPEGLTIDRTVRFENDGTMTSHHTYELDGTCVISRITVNCDGFQPDGPIMKDQLVDILPTETHMFPHGSNAVRQLCYIGFTTADGGLMMSHFDSKLTFNGSRAIKIPGPHFVTVIIKQMKDTSDKRDHVCQREVTYAHSVPRITSAI,anm2cp,0.12,597,572,120000,,,default,,0.001,anm2cp_default,,,,,,,,,,,,,,,,,,,,,,,,,,,,,,,b,,,,,,,,,,,,,,,,Q6RYS4,SEJPD
t,10.1073/pnas.97.26.14091,AAG41206,1236053,asCP562,,,,,,,,,,,,,MASFLKKTMPFKTTIEGTVNGHYFKCTGKGEGNPFEGTQEMKIEVIEGGPLPFAFHILSTSCMYGSKTFIKYVSGIPDYFKQSFPEGFTWERTTTYEDGGFLTAHQDTSLDGDCLVYKVKILGNNFPADGPVMQNKAERWEPATEILYEVDGVLRGQSLMALKCPGGRHLTCHLHSTYRSKKPASALKMPGFHFGDHRIEIMEEVEKGKCYKQYEAAVARYCDAAPSKLGHH,ascp562,,595,562,,,,default,,,ascp562_default,,,,,,,,,,,,,,,,,,,,,,,,,,,,,,,b,,,,,,,,,,,,,,,,Q9GPI5,3NV4W
t,10.1042/bj20051314,,,AsRed2,,,,,,,,,,,,,MASLLKKTMPFRTTIEGTVNGHYFKCTGKGEGNPLEGTQEMKIEVIEGGPLPFAFHILSTSCMYGSKAFIKYVSGIPDYFKQSLPEGFTWERTTTYEDGGFLTAHQDTSLDGDCLVYKVKILGNNFPADGPVMQNKAGRWEPSTEIVYEVDGVLRGQSLMALECPGGRHLTCHLHTTYRSKKPASALKMPGFHFEDHRIEILEEVEKGKCYKQYEAAVGRYCDAAPSKLGH,asred2,2.81,592,576,56200,,,default,,0.05,asred2_default,,,,,,,,,,,,,,,,,,,,,,,,,,,,,,,b,,,,,,,,,,,,,,,,,8TL1P
,10.1074/jbc.c000338200,AAG02385,514601,asulCP,,1XQM,,,,,,,,,,,MASFLKKTMPFKTTIEGTVNGHYFKCTGKGEGNPFEGTQEMKIEVIEGGPLPFAFHILSTSCMYGSKTFIKYVSGIPDYFKQSFPEGFTWERTTTYEDGGFLTAHQDTSLDGDCLVYKVKILGNNFPADGPVMQNKAGRWEPATEIVYEVDGVLRGQSLMALKCPGGRHLTCHLHTTYRSKKPASALKMPGFHFEDHRIEIMEEVEKGKCYKQYEAAVGRYCDAAPSKLGHN,asulcp,0.12,595,572,120000,,,default,,0.001,asulcp_default,,,,,,,,,,,,,,,,,,,,,,,,,,,,,,,b,,,,,,,,,,,,,,,,Q9GZ28,M3FBS
m,10.1101/2020.03.30.015156,LC085679,,AzaleaB5,,,,,,,,,,,,,MENVRRKTGIQTEMKTKLHMDGMVNGHSFEIKGEGKGSPYEGVQTMKLKVTKGAPLPFSIDILLPQCMYGSKPFIKYPENIPDYLKLSFPEGITWERTMTFEDGAVCDVSNDSRLVGNCFIYTVKFQGVNFPLDGPVMQKKTRGWEPSTEVLYECDGWMRGLVDIALKLENGGHYMCNFKTTYKSKKGLEVPPYHFVDHKLDLLSHNTDGATFEEFEQGEIAHAHLSKLA,azaleab5,60.32,596,574,104000,,,default,,0.58,azaleab5_default,,,,,,,,,,,,,,,,,,,,,,,,,,,,,,,b,,,,,,,,,,,,,,,,,886AH
,,,,CAR-GECO1,,,,,,,,,,,,,MVDSSRRKWNKAGHAVRAIGRLSSPVVSERMYPEDGALKSEIKKGLRLKDGGHYAAEVKTTYKAKKPVQLPGAYIVDIKLDIVSHNEDYTIVEQCERAEGRHSTGGMDELYKGGTGGSLVSKGVEDNMAIVKEFMRFKTHIEGSVNGHEFEIEGEGEGRPYEAFQTAKLKVTKGGPLPFAWDILSPQIMYGSKAYIKHPADIPDYFKLSFPEGFRWERVMNFEDGGIIHVNQDSSLQDGVFIYKVKLRGTNFPPDGPVMQKKTMGWEPTRDQLTEEQIAEFKEAFSLFDKDGDGTITTKELGTVMRSLGQNPTEAELQDMINEVDADGDGTFDFPEFLTMMARKMNDTDSEEEIREAFRVFDKDGNGYIGAAELRHVMTDLGEKLTDEEVDEMIRVADIDGDGQVNYEEFVQMMTAK,car-geco1,0.61,629,576,3580,,,calcium free,8.96,0.17,car-geco1_calcium-free,16.61,609,562,63900,,,calcium saturated,5.29,0.26,car-geco1_calcium-saturated,,,,,,,,,,,,,,,,,,,,,b,,,,,,,,,,,,,,,,,WZXU4
t,10.1007/s10126-007-9072-7,AAZ67342,4620339,ccalRFP1,,,,,,,,,,,,,MSLSKQVLPRDVKMRYHMDGCVNGHQFIIEGEGTGKPYEGKKILELRVTKGGPLPFAFDILSSVFTYGNRCFCEYPEDMPDYFKQSLPEGHSWERTLMFEDGGCGTASAHISLDKNCFVHKSTFHGVNFPANGPVMQKKTLNWEPSSELITAGDGILKGDVTMFLMLEGGHRLKCQFTTSYKAKKAVKMPPNHIIEHRLVRKEVADAVQIQEHAVAKHFIV,ccalrfp1,54.28,598,568,92000,,,default,,0.59,ccalrfp1_default,,,,,,,,,,,,,,,,,,,,,,,,,,,,,,,b,,,,,,,,,,,,,,,,Q2VTM9,T44E8
m,10.1371/journal.pone.0037551,,,cgfTagRFP,,,,,,,,,,,,,MSELIKENMHMKLYMEGTVNNHHFKATSEGEGKPYEGTQTMRIKVVEGGPLPFAFDILATSFMYGSRTFINHTQGIPDFFKQSFPEGFTWERVTTYEDGGVLTATQDTSLQDGMLIYNVKIRGVNFPSNGPVMQKKTLGWEANTEMLYPADGGLEGRSDMALKLVGGGHLIVNFKTTYRSKKPAKNLKMPGVYYVDHRLERIKEADKETYVEQHEVAVARYSDLPSKLGHK,cgftagrfp,45.9,585,556,90000,,,default,2.9,0.51,cgftagrfp_default,,,,,,,,,,,,,,,,,,,,,,,,,,,,,,,b,,,,,,,,,,,,,,,,,G9U12
d,10.1073/pnas.0403668101,,,d1EosFP,,,,,,,,,,,,,MSAIKPDMKINLRMEGNVNGHHFVIDGDGTGKPFEGKQSMDLEVKEGGPLPFAFDILTTAFHYGNRVFAEYPDHIQDYFKQSFPKGYSWERSLTFEDGGICIARNDITMEGDTFYNKVRFHGTNFPANGPVMQKKTLKWEPSTEKMYVRDGVLTGDITMALLLEGNAHYRCDFRTTYKAKEKGVKLPGYHFVDHCIEILSHDKDYNKVKLYEHAVAHSGLPDNARR,d1eosfp,50.86,516,505,74800,,,Green,,0.68,d1eosfp_green,24.8,581,571,40000,,,Red,,0.62,d1eosfp_red,,,,,,,,,,,,,,,,,,,,,pc,d1eosfp_green,d1eosfp_red,405,,,,,,,,,,,,,,YLRRG
d,10.1073/pnas.0403668101,,,d2EosFP,,,,,,,,,,,,,MSAIKPDMKINLRMEGNVNGHHFVIDGDGTGKPFEGKQSMDLEVKEGGPLPFAFDILTTAFHYGNRVFAEYPDHIQDYFKQSFPKGYSWERSLTFEDGGICIARNDITMEGDTFYNKVRFHGVNFPANGPVMQKKTLKWEPSTEKMYVRDGVLTGDIHMALLLEGNAHYRCDFRTTYKAKEKGVKLPGYHFVDHCIEILSHDKDYNKVKLYEHAVAHSGLPDNARR,d2eosfp,55.44,516,506,84000,,,Green,,0.66,d2eosfp_green,19.8,581,569,33000,,,Red,,0.6,d2eosfp_red,,,,,,,,,,,,,,,,,,,,,pc,d2eosfp_green,d2eosfp_red,405,,,,,,,,,,,,,,1SEDF
m,10.1038/nbt1191,,,Dendra,,,,,,,,,,,,,MNLIKEDMRVKVHMEGNVNGHAFVIEGEGKGKPYEGTQTANLTVKEGAPLPFSYDILTTAVHYGNRVFTKYPEDIPDYFKQSFPEGYSWERTMTFEDKGICTIRSDISLEGDCFFQNVRFKGTNFPPNGPVMQKKTLKWEPSTEKLHVRDGLLVGNINMALLLEGGGHYLCDFKTTYKAKKVVQLPDAHFVDHRIEILGNDSDYNKVKLYEHAVARYSPLPSQAW,dendra,14.7,505,488,21000,,,Green,6.6,0.7,dendra_green,14.4,575,556,20000,,,Red,6.9,0.72,dendra_red,,,,,,,,,,,,,,,,,,,,,pc,dendra_green,dendra_red,405,,,,,,,,,,,,,,GJDTN
m,10.1021/jacs.5b09923,,,Dendra2-T69A,,,,,,,,,,,,,MNTPGINLIKEDMRVKVHMEGNVNGHAFVIEGEGKGKPYEGTQTANLTVKEGAPLPFSYDILTTAVHYGNRVFAKYPEDIPDYFKQSFPEGYSWERTMTFEDKGICTIRSDISLEGDCFFQNVRFKGTNFPPNGPVMQKKTLKWEPSTEKLHVRDGLLVGNINMALLLEGGGHYLCDFKTTYKAKKVVQLPDAHFVDHRIEILGNDSDYNKVKLYEHAVARYSPLPSQVW,dendra2-t69a,23.8,518,502,42500,3.0,,Green,6.0,0.56,dendra2-t69a_green,22.66,578,563,35400,4.2,,Orange,7.0,0.64,dendra2-t69a_orange,,,,,,,,,,,,,,,,,,,,,pc,dendra2-t69a_green,dendra2-t69a_orange,405,,,,,,,,,,,,,,XKDOQ
d,10.1073/pnas.082243699,,,dimer1,,,,,,,,,,,,,MVASSEDVIKEFMRFKVRMEGSVNGHEFEIEGEGEGRPYEGTQTAKLKVTKGGPLPFAWDILSPQFQYGSKVYVKHPADIPDYKKLSFPEGFKWERVMNFEDGGVVTVTQDSSLQDGCFIYKVKFRGVNFPSDGPVMQKKTMGWEASTERLYPRDGVLKGEIHQALKLKDGGHYLVEFKTIYMAKKPVQLPGYYYVDTKLDITSHNEDYTIVEQYERAEGRHHLFL,dimer1,,579,551,,,,default,,,dimer1_default,,,,,,,,,,,,,,,,,,,,,,,,,,,,,,,b,,,,,,,,,,,,,,,,,ZC4KN
d,10.1073/pnas.082243699,AAM54542,142581,dimer2,,,,,,,,,,,,,MVASSEDVIKEFMRFKVRMEGSVNGHEFEIEGEGEGRPYEGTQTAKLKVTKGGPLPFAWDILSPQFQYGSKAYVKHPADIPDYKKLSFPEGFKWERVMNFEDGGVVTVTQDSSLQDGTLIYKVKFRGTNFPPDGPVMQKKTMGWEASTERLYPRDGVLKGEIHQALKLKDGGHYLVEFKTIYMAKKPVQLPGYYYVDTKLDITSHNEDYTIVEQYERSEGRHHLFL,dimer2,47.61,579,552,69000,,120.0,default,4.9,0.69,dimer2_default,,,,,,,,,,,,,,,,,,,,,,,,,,,,,,,b,,,,,,,,,,,,,,,,,DFXUK
,10.1073/pnas.062552299,AAG16224,967803,dis2RFP,,,,,,,,,,,,,MSCSKNVIKEFMRFKVRMEGTVNGHEFEIKGEGEGRPYEGHCSVKLMVTKGGPLPFAFDILSPQFQYGSKVYVKHPADIPDYKKLSFPEGFKWERVMNFEDGGVVTVSQDSSLKDGCFIYEVKFIGVNFPSDGPVMQRRTRGWEASSERLYPRDGVLKGDIHMALRLEGGGHYLVEFKSIYMVKKPSVQLPGYYYVDSKLDMTSHNEDYTVVEQYEKTQGRHHPFIKPLQ,dis2rfp,,593,573,,,,default,,,dis2rfp_default,,,,,,,,,,,,,,,,,,,,,,,,,,,,,,,b,,,,,,,,,,,,,,,,Q9GTJ7,ORVNV
d,10.1016/j.chembiol.2008.02.008,,,d-RFP618,,,,,,,,,,,,,MNSLIKENMRMMVVMEGSVNGYQFKCTGEGDGNPYMGTQTMRIKVVEGGPLPFAFDILATSFMYGSKTFIKHTKGIPDFFKQSFPEGFTWERVTRYEDGGVFTVMQDTSLEDGCLVYHAKVRGVNFPSNGAVMQKKTKGWEPSTEMLYPADGGLRGYSQMALNVDGGGYLFCSFETTYRSKKTDENFKMPGFHFVDHRLERLEESDKEMFVVQHEHAVAKFCDLPSKLGRL,d-rfp618,,618,560,,,480.0,default,,0.35,d-rfp618_default,,,,,,,,,,,,,,,,,,,,,,,,,,,,,,,b,,,,,,,,,,,,,,,,,GZCBS
,10.1016/j.cca.2004.07.002,AAU04443,3612583,DspR1,,,,,,,,,,,,,MSCSKNVIKEFMRFKVRMEGTVNGHEFEIEGEGEGRPYEGHNTVKLKVTKGGPLPFAWDILSPQFQYGSKVYVKHPADIPDYKKLSFPEGFKWERVMNFEDGGVVTVTQDPSLQDGCFIYKVKFIGVNFPSDGPVMQKKTMGWEASTERLYPRDGVLKGEIHKALKLKDGGHYLVEFKTIYMAKKPVQLPGYYYVDSKLDITSHNKDYTIVEQYERTEGRHHLFLKAELGSNVGER,dspr1,,582,556,,,,default,,,dspr1_default,,,,,,,,,,,,,,,,,,,,,,,,,,,,,,,b,,,,,,,,,,,,,,,,Q66ND8,9T6B1
t,10.1038/13657,AAF03369,836144,DsRed,,1GGX,1ZGO,,1G7K,,,,,,,,MRSSKNVIKEFMRFKVRMEGTVNGHEFEIEGEGEGRPYEGHNTVKLKVTKGGPLPFAWDILSPQFQYGSKVYVKHPADIPDYKKLSFPEGFKWERVMNFEDGGVVTVTQDSSLQDGCFIYKVKFIGVNFPSDGPVMQKKTMGWEASTERLYPRDGVLKGEIHKALKLKDGGHYLVEFKSIYMAKKPVQLPGYYYVDSKLDITSHNEDYTIVEQYERTEGRHHLFL,dsred,49.3,583,558,72500,,1600.0,default,,0.68,dsred_default,,,,,,,,,,,,,,,,,,,,,,,,,,,,,,,b,,,,,,,,,,,,,,,,Q9U6Y8,EGE3L
t,10.1007/s00299-006-0210-x,ABS86946,13508869,DsRed2,,,,,,,,,,,,,MASSENVITEFMRFKVRMEGTVNGHEFEIEGEGEGRPYEGHNTVKLKVTKGGPLPFAWDILSPQFQYGSKVYVKHPADIPDYKKLSFPEGFKWERVMNFEDGGVATVTQDSSLQDGCFIYKVKFIGVNFPSDGPVMQKKTMGWEASTERLYPRDGVLKGETHKALKLKDGGHYLVEFKSIYMAKKPVQLPGYYYVDAKLDITSHNEDYTIVEQYERTEGRHHLFL,dsred2,28.6,587,561,52000,,390.0,default,,0.55,dsred2_default,,,,,,,,,,,,,,,,,,,,,,,,,,,,,,,b,,,,,,,,,,,,,,,,,TXLFX
t,10.1038/nbt0102-83,GQ268961,,DsRed-Express,,,,,,,,,,,,,MASSEDVIKEFMRFKVRMEGSVNGHEFEIEGEGEGRPYEGTQTAKLKVTKGGPLPFAWDILSPQFQYGSKVYVKHPADIPDYKKLSFPEGFKWERVMNFEDGGVVTVTQDSSLQDGSFIYKVKFIGVNFPSDGPVMQKKTMGWEASTERLYPRDGVLKGEIHKALKLKDGGHYLVEFKSIYMAKKPVQLPGYYYVDSKLDITSHNEDYTIVEQYERAEGRHHLFL,dsred-express,12.64,586,554,30100,,42.0,default,4.8,0.42,dsred-express_default,,,,,,,,,,,,,,,,,,,,,,,,,,,,,,,b,,,,,,,,,,,,,,,,,DCYCK
,10.1038/nmeth.1264,ACJ05619,15756136,DsRed-Express2,,,,,,,,,,,,,MDSTENVIKPFMRFKVHMEGSVNGHEFEIEGEGEGKPYEGTQTAKLQVTKGGPLPFAWDILSPQFQYGSKVYVKHPADIPDYKKLSFPEGFKWERVMNFEDGGVVTVTQDSSLQDGTFIYHVKFIGVNFPSDGPVMQKKTLGWEPSTERLYPRDGVLKGEIHKALKLKGGGHYLVEFKSIYMAKKPVKLPGYYYVDSKLDITSHNEDYTVVEQYERAEARHHLFQ,dsred-express2,14.95,591,554,35600,,42.0,default,,0.42,dsred-express2_default,,,,,,,,,,,,,,,,,,,,,,,,,,,,,,,b,,,,,,,,,,,,,,,,,5DP2R
m,10.1093/protein/gzm046,,,DsRed.M1,,2VAD,,,,,,,,,,,MDNTEDVIKEFMQFKVRMEGSVNGHYFEIEGEGEGKPYEGTQTAKLQVTKGGPLPFAWDILSPQFQYGSKAYVKHPADIPDYMKLSFPEGFTWERSMNFEDGGVVEVQQDSSLQDGTFIYKVKFKGVNFPADGPVMQKKTAGWEPSTEKLYPQDGVLKGEISHALKLKDGGHYTCDFKTVYKAKKPVQLPGNHYVDSKLDITNHNEDYTVVEQYEHAEARHSGSQ,dsredm1,3.82,587,558,27300,1.4,,default,,0.14,dsredm1_default,,,,,,,,,,,,,,,,,,,,,,,,,,,,,,,b,,,,,,,,,,,,,,,,,N33JN
t,10.1038/nmeth.1264,ACJ05620,,DsRed-Max,,2V4E,,,,,,,,,,,MDSTENVIKPFMRFKVHMEGSVNGHEFEIEGEGEGKPYEGTQTAKLQVTKGGPLPFAWDILSPQFMYGSKVYTKHPADIPDYKKLSFPEGFKWERVMNFEDGGVVTVTQDSSLQDGTFIYHVKFIGVNFPSDGPVMQKKTLGWEPSTERLYPRDGVLKGEIHKALKLKGGGHYLCEFKSIYMAKKPVKLPGYYYVDSKLDITSHNEDYTVVEQYERTEARHHLFQ,dsred-max,19.68,589,560,48000,,72.0,default,,0.41,dsred-max_default,,,,,,,,,,,,,,,,,,,,,,,,,,,,,,,b,,,,,,,,,,,,,,,,,UVJD2
t,10.1038/nbt0102-83,,,DsRed.T3,,,,,,,,,,,,,MASSEDVIKEFMRFKVRMEGSVNGHEFEIEGEGEGRPYEGTQTAKLKVTKGGPLPFAWDILSPQFQYGSKVYVKHPADIPDYKKLSFPEGFKWERVMNFEDGGVVTVTQDSSLQDGCFIYKVKFIGVNFPSDGPVMQKKTMGWEPSTERLYPRDGVLKGEIHKALKLKDGGHYLVEFKSIYMAKKPVQLPGYYYVDSKLDITSHNEDYTIVEQYERTEGRHHLFL,dsredt3,29.2,587,560,49500,,78.0,default,,0.59,dsredt3_default,,,,,,,,,,,,,,,,,,,,,,,,,,,,,,,b,,,,,,,,,,,,,,,,,FRM5D
t,10.1038/nbt0102-83,,,DsRed.T4,,2VAE,,,,,,,,,,,MASSEDVIKEFMRFKVRMEGSVNGHEFEIEGEGEGRPYEGTQTAKLKVTKGGPLPFAWDILSPQFQYGSKVYVKHPADIPDYKKLSFPEGFKWERVMNFEDGGVVTVTQDSSLQDGCFIYKVKFIGVNFPSDGPVMQKKTMGWEPSTERLYPRDGVLKGEIHKALKLKDGGHYLVEFKSIYMAKKPVQLPGYYYVDSKLDITSHNEDYTIVEQYERAEGRHHLFL,dsredt4,13.33,586,555,30300,,42.6,default,,0.44,dsredt4_default,,,,,,,,,,,,,,,,,,,,,,,,,,,,,,,b,,,,,,,,,,,,,,,,,XHBTX
d,10.1038/nbt1037,AAV52168,3838230,dTomato,,,,,,,,,,,,,MVSKGEEVIKEFMRFKVRMEGSMNGHEFEIEGEGEGRPYEGTQTAKLKVTKGGPLPFAWDILSPQFMYGSKAYVKHPADIPDYKKLSFPEGFKWERVMNFEDGGLVTVTQDSSLQDGTLIYKVKMRGTNFPPDGPVMQKKTMGWEASTERLYPRDGVLKGEIHQALKLKDGGHYLVEFKTIYMAKKPVQLPGYYYVDTKLDITSHNEDYTIVEQYERSEGRHHLFLYGMDELYK,dtomato,47.61,581,554,69000,,60.0,default,4.7,0.69,dtomato_default,,,,,,,,,,,,,,,,,,,,,,,,,,,,,,,b,,,,,,,,,,,,,,,,,G1DQY
,10.1186/1472-6750-9-32,FJ498892,,E2-Red/Green,,,,,,,,,,,,,MDSTENVIKPFMRFKVHMEGSVNGHEFEIEGEGEGKPYEGTHTVKLQVTKGGPLPFAWDILSPQFQYGSKVYVKHPADIPDYKKLSFPEGFKWERVMNFEDGGVVTVTQDSSLQDGTFIYHVKFIGVNFPSDGPVMQKKTLGWEPSTERLYPRDGVLKGEIHKALKLKGGGHYLVEFKSIYMAKKPVKLPGYYYVDSKLDITSHNEDYTVVEQYERTEGRHHLFQ,e2-redgreen,36.05,585,560,53800,,72.0,default,4.5,0.67,e2-redgreen_default,,,,,,,,,,,,,,,,,,,,,,,,,,,,,,,b,,,,,,,,,,,,,,,,,VB2NB
t,10.1371/journal.pone.0002680,ABB17960,4901527,eechRFP,,,,,,,,,,,,,MSLINPEMKIKLLMEGNVNGHPFVIEGDGKGHPFEGKQSMDLVVKEGAPLPFAYDILTTAFHYGNRVFAKYPDHIPDYFKQSFPNGFSWERSLMFEDGGVCIATNDITLEGDTFFNKVRFYGVNFPPNGPVMQKKTLKWEASTEKMYLRDGVLTGDITMALLLKGDVHYRCDFRTTYKSRQEGVKLPGYHFVDHCISIVSHDKDYTKVKLYEHAVAHLGLPENVK,eechrfp,5.2,582,574,12100,,,default,,0.43,eechrfp_default,,,,,,,,,,,,,,,,,,,,,,,,,,,,,,,b,,,,,,,,,,,,,,,,A8CLS2,JB7SD
d,10.1038/nmeth1062,,,eqFP578,,,,,,,,,,,,,MSELIKENMHMKLYMEGTVNNHHFKCTSEGERKPYEGTQTMKIKVVEGGPLPFAFDILATSFMYGSKTFINHTQGIPDLFKQSFPEGFTWERITTYEDGGVLTATQDTSLQNGCIIYNVKINGVNFPSNGSVMQKKTLGWEANTEMLYPADGGLRGHSQMALKLVGGGYLHCSFKTTYRSKKPAKNLKMPGFHFVDHRLERIKEADKETYVEQHEMAVAKYCDLPSKLGHR,eqfp578,55.08,578,552,102000,,,default,,0.54,eqfp578_default,,,,,,,,,,,,,,,,,,,,,,,,,,,,,,,b,,,,,,,,,,,,,,,,H3JQU7,G5OWS
t,10.1073/pnas.182157199,AAN05449,612407,eqFP611,,1UIS,,,,,,,,,,,MNSLIKENMRMMVVMEGSVNGYQFKCTGEGDGNPYMGTQTMRIKVVEGGPLPFAFDILATSFMYGSKTFIKHTKGIPDFFKQSFPEGFTWERVTRYEDGGVFTVMQDTSLEDGCLVYHAKVTGVNFPSNGAVMQKKTKGWEPNTEMLYPADGGLRGYSQMALNVDGGGYLSCSFETTYRSKKTVENFKMPGFHFVDHRLERLEESDKEMFVVQHEHAVAKFCDLPSKLGRL,eqfp611,35.1,611,559,78000,2.5,270.0,default,3.84,0.45,eqfp611_default,,,,,,,,,,,,,,,,,,,,,,,,,,,,,,,b,,,,,,,,,,,,,,,,Q8ISF8,R5RQ5
d,10.1117/1.1854680,,,eqFP611 V124T,,3E5T,,,,,,,,,,,MNSLIKENMRMMVVMEGSVNGYQFKCTGEGDGNPYMGTQTMRIKVVEGGPLPFAFDILATSFMYGSKTFIKHTKGIPDFFKQSFPEGFTWERVTRYEDGGVFTVMQDTSLEDGCLVYHAKVTGTNFPSNGAVMQKKTKGWEPNTEMLYPADGGLRGYSQMALNVDGGGYLSCSFETTYRSKKTVENFKMPGFHFVDHRLERLEESDKEMFVVQHEHAVAKFCDLPSKLGRL,eqfp611-v124t,31.08,611,559,74000,,450.0,default,,0.42,eqfp611-v124t_default,,,,,,,,,,,,,,,,,,,,,,,,,,,,,,,b,,,,,,,,,,,,,,,,,ALL3F
,10.1016/j.molimm.2012.10.003,AAQ11987,1722071,FP586,,,,,,,,,,,,,MSCSKNVIKEFMRFKVRMEGTVNGHEFEIEGEGEGRPYGGHNTVKLKVTKGGPLPFAWDILSPQFQYGSKVYVKHPADIPDYKKLSFPEGFKWERVMNFEDGGVVTVTQDSSLQDGCFIYKVKFIGVNFPSDGPVMQKKTMGWEASTERLYPRDGVLKGDIHKALKLKDGGHYLVEFKSIYMAKKPVQLPGYYYVDSKLDITSHNEDYTIVEQYERTEGRHHLFL,fp586,,586,559,,,,default,,,fp586_default,,,,,,,,,,,,,,,,,,,,,,,,,,,,,,,b,,,,,,,,,,,,,,,,Q6KF85,WUW5F
m,10.1039/c8ib00103k,,,FR-1,,,,,,,,,,,,,MVSELIKENMPMKLYMEGTINNHHFKCTSEGEGKPYEGTQTMRIKVVEGGPPPFAFDILATSFMYGSRTFIKHPPGIPDFFKQSFPEGFTWERVTTYEDGGVLTATQDTSLQDGCLIYNVKVRGVNFPANGPVMQKKTLGWEASTETMYPADGGLEGACDMALKLVGGGHMICNLETTYRSKKPATNLKMPGVYNVDHRLERIKEADDETYVEQHEVAVARYSTGGAGDGGK,fr-1,28.87,594,569,84900,2.3,,default,,0.34,fr-1_default,,,,,,,,,,,,,,,,,,,,,,,,,,,,,,,b,,,,,,,,,,,,,,,,,39D4R
m,10.1038/ncomms2208,,,FusionRed,,,,,,,,,,,,,MVSELIKENMPMKLYMEGTVNNHHFKCTSEGEGKPYEGTQTMRIKVVEGGPLPFAFDILATSFMYGSRTFIKHPPGIPDFFKQSFPEGFTWERVTTYEDGGVLTATQDTSLQDGCLIYNVKVRGVNFPANGPVMQKKTLGWEASTETMYPADGGLEGACDMALKLVGGGHLICNLETTYRSKKPATNLKMPGVYNVDHRLERIKEADDETYVEQHEVAVARYSTGGAGDGGK,fusionred,17.95,608,580,94500,1.8,130.0,default,4.6,0.19,fusionred_default,,,,,,,,,,,,,,,,,,,,,,,,,,,,,,,b,,,,,,,,,,,,,,,,,S6A7A
m,10.1039/c8ib00103k,,,FusionRed-M,,,,,,,,,,,,,MVSELIKENMPMKLYMEGTVNNHHFKCTSEGEGKPYEGTQTMRIKVVEGGPLPFAFDILATSFMYGSRTFIKHPPGIPDFFKQSFPEGFTWERVTTYEDGGVLTATQDTSLQDGCLIYNVKVRGVNFPANGPVMQKKTLGWEASTETMYPADGGLEGACDMALKLVGGGHMICNLETTYRSKKPATNLKMPGVYNVDHRLERIKEADDETYVEQHEVAVARYSTGGAGDGGK,fusionred-m,24.17,594,571,71100,2.1,,default,,0.34,fusionred-m_default,,,,,,,,,,,,,,,,,,,,,,,,,,,,,,,b,,,,,,,,,,,,,,,,,E3FDV
m,10.1021/acs.biochem.0c00484,,,FusionRed-MQV,,,,,,,,,,,,,MVSELIKENMPMKLYMEGTVNNHHFKCTSEGEGKPYEGTQTQRIKVVEGGPLPFAFDILATSFMYGSRTFIKHPPGIPDFFKQSFPEGFTWERVTTYEDGGVLTATQDTSLQDGCLIYNVKVRGVNFPANGPVMQKKTLGWEASTETMYPADGGLEGAVDMALKLVGGGHLICNMETTYRSKKPATNLKMPGVYNVDHRLERIKEADDETYVEQHEVAVARYSTGGAGDGGK,fusionred-mqv,76.32,585,566,144000,2.77,195.0,default,4.6,0.53,fusionred-mqv_default,,,,,,,,,,,,,,,,,,,,,,,,,,,,,,,b,,,,,,,,,,,,,,,,,F35B7
td,10.1002/cbic.201600492,,,GRvT,,,,,,,,,,,,,MVSKGEEVIKEFMRFKVRMEGSMNGHEFEIEGEGEGRPYEGTQTAKLKVTKGGPLPFAWDILSPLLMYGSKMYVKHPADIPDYKKLSFPEGFKWVRVMNFEDGGLVTATQDSSLQDGTLIYEVKMRGTNFPPDGPVMQKKTMGWEASTERLYPRDGVLKGEIHQALKLKDGGHYLVEFKTIYMAKKPVQLPGYYYVDTKLDITSHNEDYTRVEQYERSEGRHHLFLYDGSTGSGSSGTMVSKGEEVIKEFMRFKVRMEGSMNGHEFEIEGEGEGRPYEGTQTAKLKVTKGGPLPFAWDILSPQFMYGSKAYVKHPADIPDYKKLSFPEGFKWERVMNFEDGGLVTVTQDSSIQDGTLIYKVKMRGTNFPPDGPVMQKKTMGWEASTERLYPRDGVLKGEIHQALKLKDGGHYLVEFKTIYMAKKPVQLPGYYYVDTKLDITSHNEDYTIVEQYERSEGRHHLFLYGMDELYK,grvt,68.87,583,557,71000,,,Red excitation,2.5,0.97,grvt_red-excitation,36.49,583,477,89000,,,FRET excitation,3.3,0.41,grvt_fret-excitation,,,,,,,,,,,,,,,,,,,,,b,,,,,,,,,,,,,,,,,H93B4
m,10.1371/journal.pone.0095808,,,iq-mApple,,,,,,,,,,,,,,iq-mapple,12.38,593,568,34400,,,default,,0.36,iq-mapple_default,,,,,,,,,,,,,,,,,,,,,,,,,,,,,,,b,,,,,,,,,,,,,,,,,WPO9A
m,10.1371/journal.pone.0095808,,,iq-mKate2,,,,,,,,,,,,,,iq-mkate2,3.94,632,580,11600,,,default,,0.34,iq-mkate2_default,,,,,,,,,,,,,,,,,,,,,,,,,,,,,,,b,,,,,,,,,,,,,,,,,QNUKK
t,10.1073/pnas.0805949105,,,IrisFP,,2VVI,4LJD,4LJB,5FVG,5FVI,3TMT,3TMR,2VVJ,4LJC,5FVF,2VVH,MSAIKPDMKINLRMEGNVNGHHFVIDGDGTGKPFEGKQSMDLEVKEGGPLPFAFDILTTAFHYGNRVFAEYPDHIQDYFKQSFPKGYSWERSLTFEDGGICIARNDITMEGDTFYNKVRFHGVNFPANGPVMQKKTLKWEPSTEKMYVRDGVLTGDITMALLLEGNAHYRCDSRTTYKAKEKGVKLPGYHLVDHCIEILSHDKDYNKVKLYEHAVAHSGLPDNARR,irisfp,22.45,516,488,52200,,,Green,5.7,0.43,irisfp_green,16.64,580,551,35400,,,Orange,,0.47,irisfp_orange,,,,,,,Green (off),,,irisfp_green-off,,,,,,,Orange (off),,,irisfp_orange-off,mp,irisfp_green,irisfp_green-off,488,irisfp_green-off,irisfp_green,405,irisfp_green,irisfp_orange,405,irisfp_orange,irisfp_orange-off,561,irisfp_orange-off,irisfp_orange,440,,PA6OT
,,,,jRCaMP1a,,,,,,,,,,,,,,jrcamp1a,12.39,595,573,42735,,,calcium free,6.48,0.29,jrcamp1a_calcium-free,33.44,594,572,61920,,,calcium saturated,6.2,0.54,jrcamp1a_calcium-saturated,,,,,,,,,,,,,,,,,,,,,b,,,,,,,,,,,,,,,,,7VM5E
,,,,jREX-GECO1,,,,,,,,,,,,,,jrex-geco1,1.94,599,577,31746,,,calcium free,4.6,0.061,jrex-geco1_calcium-free,6.8,585,474,34000,,,calcium saturated,11.63,0.2,jrex-geco1_calcium-saturated,,,,,,,,,,,,,,,,,,,,,b,,,,,,,,,,,,,,,,,YPB84
t,10.1038/nbt778,AAO43187,605230,KFP1,,,,,,,,,,,,,MASLLTETMPFKTTIEGTVNGHCFKCIGKGEGNPFEGTQEMKIEVIEGGPLPFAFHILSTSCMYGSKTFIKYVSGIPDYFKQSFPEGFTWERTTTYEDGGFLTAHQDTSLDGDCLVYKVKILGNNFPADGPVMQNKVGRWEPGTEIVYEVDGVLRGQSLMALKCPGGRHLTCHLHTTYRSKKPASALKMPGFHFEDHRIEIMEEVEKGKCYKQYEAAVGRYCDAAPSKLGHN,kfp1,0.01,600,580,123000,,,Off,,0.0001,kfp1_off,4.13,600,580,59000,,,On,,0.07,kfp1_on,,,,,,,,,,,,,,,,,,,,,pa,kfp1_off,kfp1_on,560,,,,,,,,,,,,,,5N1DD
,,,,K-GECO1,,,,,,,,,,,,,,k-geco1,3.56,597,572,18750,,,calcium free,6.71,0.19,k-geco1_calcium-free,30.1,593,569,62700,,,calcium saturated,6.34,0.48,k-geco1_calcium-saturated,,,,,,,,,,,,,,,,,,,,,b,,,,,,,,,,,,,,,,,5ELUZ
d,10.1042/bj20040321,BAD24721,3504951,KO,,,,,,,,,,,,,MSVIKPEMKMKYFMDGSVNGHEFTVEGEGTGKPYEGHQEMTLRVTMAKGGPMPFSFDLVSHTFCYGHRPFTKYPEEIPDYFKQAFPEGLSWERSLQFEDGGFAAVSAHISLRGNCFEHKSKFVGVNFPADGPVMQNQSSDWEPSTEKITTCDGVLKGDVTMFLKLAGGGNHKCQFKTTYKAAKKILKMPQSHFIGHRLVRKTEGNITELVEDAVAHC,ko,49.39,561,548,109750,4.2,,default,5.0,0.45,ko_default,,,,,,,,,,,,,,,,,,,,,,,,,,,,,,,b,,,,,,,,,,,,,,,,Q6I7B3,A8BXL
t,10.1042/bj20021796,,,M355NA,,,,,,,,,,,,,MASFLTETMPFKTTIEGTVNGHYFKCTGKGEGNPFEGTQEMKIEVIEGGPLPFAFHILSTSCMYGSKTFIKYVSGIPDYFKQSFPEGFTWERTTTYEDGGFLTAHQDTSLDGDCLVYKVKILGNNFPADGPVMQNKAGRWEPCTEIVYEVDGVLRGQSLMALKCPGGRHLTCHLHTTYRSKKPASALKMPGFHFEDHRIEIMEEVEKGKCYKQYEAAVGRYCDAAPSKLGHN,m355na,46.2,595,572,220000,,,default,,0.21,m355na_default,,,,,,,,,,,,,,,,,,,,,,,,,,,,,,,b,,,,,,,,,,,,,,,,,PO1ML
m,10.1038/nmeth.1209,ABC66097,,mApple,,,,,,,,,,,,,MVSKGEENNMAIIKEFMRFKVHMEGSVNGHEFEIEGEGEGRPYEAFQTAKLKVTKGGPLPFAWDILSPQFMYGSKVYIKHPADIPDYFKLSFPEGFRWERVMNFEDGGIIHVNQDSSLQDGVFIYKVKLRGTNFPSDGPVMQKKTMGWEASEERMYPEDGALKSEIKKRLKLKDGGHYAAEVKTTYKAKKPVQLPGAYIVDIKLDIVSHNEDYTIVEQYERAEGRHSTGGMDELYK,mapple,36.75,592,568,75000,2.9,30.0,default,6.5,0.49,mapple_default,,,,,,,,,,,,,,,,,,,,,,,,,,,,,,,b,,,,,,,,,,,,,,,,,T5UGO
m,10.26434/chemrxiv-2022-v3t03,,,mCherry-XL,,,,,,,,,,,,,MVSKGEEDNMAIIKEFMRFKVHMEGSVNGHEFEIEGEGEGRPYEGTQTAKLKVTKGGPLPFAWDILSPQFMYGSKAYVKHPADIPDYLKLSFPEGFKWERVMNFEDGGVVTVTQDSSLQDGEFIYKVKLRGTNFPSDGPVMQKKTMGSEASSERMYPEDGALKGEVKYRLKLKDGGHYDAEVKTTYKAKKPVQLPGAYNVNRKLDITSHNEDYTIVEQYERAEGRHSTGGMDELYK,mcherry-xl,50.4,589,558,72000,3.9,,Fluorescent,4.6,0.7,mcherry-xl_fluorescent,,,,,,,,,,,,,,,,,,,,,,,,,,,,,,,b,,,,,,,,,,,,,,,,,HZMZV
t,10.1371/journal.pone.0002680,ABB17952,4901499,meffRFP,,,,,,,,,,,,,MALSKNGLTKNMTTKYRMEGCVDGHKFVITGDGIGDPFEGKQTSIDLCVVEGGPLPFSEDILSAVFDYGNRVFTKYPQDLVDYFKNSCPAGYTWQRSFLFEDGAVCTASADITVSVEENCFYHESKFHGVNFPADGPVMKKMTTNWEPSCEKITPIPNEGILKGDVTMFLLLKDGGRYRCQFDTVYKAKSDPKTIMMPDWHFIQHKLNREDRSDAKHQKWRLVENAIAYRSTLS,meffrfp,55.78,576,560,99600,,,default,,0.56,meffrfp_default,,,,,,,,,,,,,,,,,,,,,,,,,,,,,,,b,,,,,,,,,,,,,,,,A8CLN4,ND36H
t,10.1371/journal.pone.0002680,ABB17959,4901479,meleRFP,,,,,,,,,,,,,MSVIKPDMKLKLRMEGTVNGHYFVIEGDGKGRPFEGKQSMDLDVKEGGPLPFAYDILTTAFHYGNRVFAEYPDHIPDYFKQSFPGGYSWERSLTFEDGGICIARNDIKMVGDTFYNTVRFDGVNFPPNGPVMQRRTQKWEPSTEKIYVRDGVLTGDITMALLLEGGVHYRCDFRTTYKAKEKGVQLPGYHFVDHCIEILSHDKDYNKVKLYEHAVAHSGLPDNKRQ,melerfp,38.76,579,573,45600,,,default,,0.85,melerfp_default,,,,,,,,,,,,,,,,,,,,,,,,,,,,,,,b,,,,,,,,,,,,,,,,A8CLR7,UWMXB
m,10.1021/jacs.5b09923,,,mEos2-A69T,,5DTL,,,,,,,,,,,MSAIKPDMKIKLRMEGNVNGHHFVIDGDGTGKPFEGKQSMDLEVKEGGPLPFAFDILTTAFHYGNRVFTKYPDNIQDYFKQSFPKGYSWERSLTFEDGGICIARNDITMEGDTFYNKVRFYGTNFPANGPVMQKKTLKWEPSTEKMYVRDGVLTGDIHMALLLEGNAHYRCDFRTTYKAKEKGVKLPGYHFVDHCIEILSHDKDYNKVKLYEHAVAHSGLPDNARR,meos2-a69t,15.31,509,495,24300,3.4,,Green,8.2,0.63,meos2-a69t_green,7.59,580,565,11500,4.2,,Orange,7.4,0.66,meos2-a69t_orange,,,,,,,,,,,,,,,,,,,,,pc,meos2-a69t_green,meos2-a69t_orange,405,,,,,,,,,,,,,,YJY7C