agg,doi,genbank,ipg_id,name,pdb.0,pdb.1,seq,slug,states.0.brightness,states.0.em_max,states.0.ex_max,states.0.ext_coeff,states.0.lifetime,states.0.maturation,states.0.name,states.0.pka,states.0.qy,states.0.slug,states.1.brightness,states.1.em_max,states.1.ex_max,states.1.ext_coeff,states.1.lifetime,states.1.maturation,states.1.name,states.1.pka,states.1.qy,states.1.slug,switch_type,transitions.0.from_state,transitions.0.to_state,transitions.0.trans_wave,transitions.1.from_state,transitions.1.to_state,transitions.1.trans_wave,uniprot,uuid
wd,10.1038/nbt945,,,Cerulean,2Q57,2WSO,MVSKGEELFTGVVPILVELDGDVNGHKFSVSGEGEGDATYGKLTLKFICTTGKLPVPWPTLVTTLTWGVQCFARYPDHMKQHDFFKSAMPEGYVQERTIFFKDDGNYKTRAEVKFEGDTLVNRIELKGIDFKEDGNILGHKLEYNAISDNVYITADKQKNGIKANFKIRHNIEDGSVQLADHYQQNTPIGDGPVLLPDNHYLSTQSALSKDPNEKRDHMVLLEFVTAAGITLGMDELYK,cerulean,26.66,475,433,43000,3.3,,default,4.7,0.62,cerulean_default,,,,,,,,,,,b,,,,,,,,CVUYM
d,10.1073/pnas.91.26.12501,,,CFP,,,MSKGEELFTGVVPILVELDGDVNGHKFSVSGEGEGDATYGKLTLKFICTTGKLPVPWPTLVTTFSWGVQCFSRYPDHMKQHDFFKSAMPEGYVQERTIFFKDDGNYKTRAEVKFEGDTLVNRIELKGIDFKEDGNILGHKLEYNYNSHNVYIMADKQKNGIKVNFKIRHNIEDGSVQLADHYQQNTPIGDGPVLLPDNHYLSTQSALSKDPNEKRDHMVLLEFVTAAGITHGMDELYK,cfp,,480,456,,,,default,,,cfp_default,,,,,,,,,,,b,,,,,,,,ZRLU4
m,10.1038/nbt1191,,,Dendra2,2VZX,,MNTPGINLIKEDMRVKVHMEGNVNGHAFVIEGEGKGKPYEGTQTANLTVKEGAPLPFSYDILTTAVHYGNRVFTKYPEDIPDYFKQSFPEGYSWERTMTFEDKGICTIRSDISLEGDCFFQNVRFKGTNFPPNGPVMQKKTLKWEPSTEKLHVRDGLLVGNINMALLLEGGGHYLCDFKTTYKAKKVVQLPDAHFVDHRIEILGNDSDYNKVKLYEHAVARYSPLPSQVW,dendra2,22.5,507,490,45000,3.3,,Green,6.6,0.5,dendra2_green,19.25,573,553,35000,4.4,,Red,6.9,0.55,dendra2_red,pc,dendra2_green,dendra2_red,480,dendra2_green,dendra2_red,405,,GE6KO
wd,10.1016/0378-1119(95)00685-0,AAB02572,928978,EGFP,2Y0G,4EUL,MVSKGEELFTGVVPILVELDGDVNGHKFSVSGEGEGDATYGKLTLKFICTTGKLPVPWPTLVTTLTYGVQCFSRYPDHMKQHDFFKSAMPEGYVQERTIFFKDDGNYKTRAEVKFEGDTLVNRIELKGIDFKEDGNILGHKLEYNYNSHNVYIMADKQKNGIKVNFKIRHNIEDGSVQLADHYQQNTPIGDGPVLLPDNHYLSTQSALSKDPNEKRDHMVLLEFVTAAGITLGMDELYK,egfp,33.54,507,488,55900,2.6,25.0,default,6.0,0.6,egfp_default,,,,,,,,,,,b,,,,,,,C5MKY7,R9NL8
wd,10.1126/science.273.5280.1392,,,EYFP,,,MVSKGEELFTGVVPILVELDGDVNGHKFSVSGEGEGDATYGKLTLKFICTTGKLPVPWPTLVTTFGYGLQCFARYPDHMKQHDFFKSAMPEGYVQERTIFFKDDGNYKTRAEVKFEGDTLVNRIELKGIDFKEDGNILGHKLEYNYNSHNVYIMADKQKNGIKVNFKIRHNIEDGSVQLADHYQQNTPIGDGPVLLPDNHYLSYQSALSKDPNEKRDHMVLLEFVTAAGITLGMDELYK,eyfp,44.89,527,513,67000,3.1,9.0,default,6.9,0.67,eyfp_default,,,,,,,,,,,b,,,,,,,,8DNLG
t,10.1073/pnas.202320599,BAC20344,,Kaede,,,MSLIKPEMKIKLLMEGNVNGHQFVIEGDGKGHPFEGKQSMDLVVKEGAPLPFAYDILTTAFHYGNRVFAKYPDHIPDYFKQSFPKGFSWERSLMFEDGGVCIATNDITLKGDTFFNKVRFDGVNFPPNGPVMQKKTLKWEASTEKMYLRDGVLTGDITMALLLKGDVHYRCDFRTTYKSRQEGVKLPGYHFVDHCISILRHDKDYNEVKLYEHAVAHSGLPDNVK,kaede,19.93,580,572,60400,4.2,,Red,5.6,0.33,kaede_red,86.94,518,508,98800,3.4,,Green,5.6,0.88,kaede_green,pc,kaede_green,kaede_red,380,,,,,Q31FH
m,10.1038/nmeth.2888,AHL19967,49083567,mCardinal,4OQW,,MVSKGEELIKENMHMKLYMEGTVNNHHFKCTTEGEGKPYEGTQTQRIKVVEGGPLPFAFDILATCFMYGSKTFINHTQGIPDFFKQSFPEGFTWERVTTYEDGGVLTVTQDTSLQDGCLIYNVKLRGVNFPSNGPVMQKKTLGWEATTETLYPADGGLEGRCDMALKLVGGGHLHCNLKTTYRSKKPAKNLKMPGVYFVDRRLERIKEADNETYVEQHEVAVARYCDLPSKLGHKLNGMDELYK,mcardinal,16.53,659,604,87000,,27.0,default,5.3,0.19,mcardinal_default,,,,,,,,,,,b,,,,,,,,7EWEM
m,10.1038/nbt1037,AAV52164,3838123,mCherry,2H5Q,,MVSKGEEDNMAIIKEFMRFKVHMEGSVNGHEFEIEGEGEGRPYEGTQTAKLKVTKGGPLPFAWDILSPQFMYGSKAYVKHPADIPDYLKLSFPEGFKWERVMNFEDGGVVTVTQDSSLQDGEFIYKVKLRGTNFPSDGPVMQKKTMGWEASSERMYPEDGALKGEIKQRLKLKDGGHYDAEVKTTYKAKKPVQLPGAYNVNIKLDITSHNEDYTIVEQYERAEGRHSTGGMDELYK,mcherry,15.84,610,587,72000,1.4,15.0,default,4.5,0.22,mcherry_default,,,,,,,,,,,b,,,,,,,X5DSL3,ZERB6
m,10.1042/bj20081949,,,mKate2,,,MVSELIKENMHMKLYMEGTVNNHHFKCTSEGEGKPYEGTQTMRIKAVEGGPLPFAFDILATSFMYGSKTFINHTQGIPDFFKQSFPEGFTWERVTTYEDGGVLTATQDTSLQDGCLIYNVKIRGVNFPSNGPVMQKKTLGWEASTETLYPADGGLEGRADMALKLVGGGHLICNLKTTYRSKKPAKNLKMPGVYYVDRRLERIKEADKETYVEQHEVAVARYCDLPSKLGHR,mkate2,25.0,633,588,62500,2.5,20.0,default,5.4,0.4,mkate2_default,,,,,,,,,,,b,,,,,,,,DBBO8
m,10.1016/j.cell.2007.12.033,BAG06989,14335281,mKO2,,,MVSVIKPEMKMRYYMDGSVNGHEFTIEGEGTGRPYEGHQEMTLRVTMAEGGPMPFAFDLVSHVFCYGHRVFTKYPEEIPDYFKQAFPEGLSWERSLEFEDGGSASVSAHISLRGNTFYHKSKFTGVNFPADGPIMQNQSVDWEPSTEKITASDGVLKGDVTMYLKLEGGGNHKCQMKTTYKAAKEILEMPGDHYIGHRLVRKTEGNITEQVEDAVAHS,mko2,39.56,565,551,63800,,108.0,default,5.5,0.62,mko2_default,,,,,,,,,,,b,,,,,,,,134NN
m,10.1038/nmeth.2413,AGG56535,34051755,mNeonGreen,5LTP,5LTR,MVSKGEEDNMASLPATHELHIFGSINGVDFDMVGQGTGNPNDGYEELNLKSTKGDLQFSPWILVPHIGYGFHQYLPYPDGMSPFQAAMVDGSGYQVHRTMQFEDGASLTVNYRYTYEGSHIKGEAQVKGTGFPADGPVMTNSLTAADWCRSKKTYPNDKTIISTFKWSYTTGNGKRYRSTARTTYTFAKPMAANYLKNQPMYVFRKTELKHSKTELNFKEWQKAFTDVMGMDELYK,mneongreen,92.8,517,506,116000,3.1,10.0,default,5.7,0.8,mneongreen_default,,,,,,,,,,,b,,,,,,,,ZRKRV
m,10.1038/nmeth.2888,AHL19969,49083569,mNeptune2.5,,,MVSKGEELIKENMHTKLYMEGTVNNHHFKCTHEGEGKPYEGTQTNRIKVVEGGPLPFAFDILATCFMYGSKTFINHTQGIPDFFKQSFPEGFTWERVTTYEDGGVLTVTQDTSLQDGCLIYNVKLRGVNFPSNGPVMQKKTLGWEASTETLYPADGGLEGRCDMALKLVGGGHLHCNLKTTYRSKKPAKNLKMPGVYFVDRRLERIKEADNETYVEQHEVAVARYCDLPSKLGHKLNGMDELYK,mneptune25,22.8,643,599,95000,,26.0,default,5.8,0.24,mneptune25_default,,,,,,,,,,,b,,,,,,,,OADBJ
m,10.1038/nmeth.4074,APD76536,129830965,mScarlet-I,,,MVSKGEAVIKEFMRFKVHMEGSMNGHEFEIEGEGEGRPYEGTQTAKLKVTKGGPLPFSWDILSPQFMYGSRAFIKHPADIPDYYKQSFPEGFKWERVMNFEDGGAVTVTQDTSLEDGTLIYKVKLRGTNFPPDGPVMQKKTMGWEASTERLYPEDGVLKGDIKMALRLKDGGRYLADFKTTYKAKKPVQMPGAYNVDRKLDITSHNEDYTVVEQYERSEGRHSTGGMDELYK,mscarlet-i,56.16,593,569,104000,3.1,36.0,default,5.4,0.54,mscarlet-i_default,,,,,,,,,,,b,,,,,,,,6VVTK
m,10.1371/journal.pone.0028674,,,mTagBFP2,,,MVSKGEELIKENMHMKLYMEGTVDNHHFKCTSEGEGKPYEGTQTMRIKVVEGGPLPFAFDILATSFLYGSKTFINHTQGIPDFFKQSFPEGFTWERVTTYEDGGVLTATQDTSLQDGCLIYNVKIRGVNFTSNGPVMQKKTLGWEAFTETLYPADGGLEGRNDMALKLVGGSHLIANAKTTYRSKKPAKNLKMPGVYYVDYRLERIKEANNETYVEQHEVAVARYCDLPSKLGHKLN,mtagbfp2,32.38,454,399,50600,2.6,12.0,default,2.7,0.64,mtagbfp2_default,,,,,,,,,,,b,,,,,,,,ZO7NN
m,10.1021/acscatal.9b02896,,,mTFP*,4Q9W,,MSGVIKPDMKIKLKMEGNVNGYAFVIEGEGEGKPYDGTNTINLEVKEGAPLPFSYDILTTAFAYGNRAFTKYPDDIPNYFKQSFPEGYSWERTMTFEDKGIVKVKSDISLEEDSFIYEIYLKGENFPPNGPVMQKKTTGWDASTERMYVRDGVLKGDVKHKLLLEGGGYYRVDFKTIYRAKKAVKLPDYHFVDHRIEILNYDKDYNKVTVYESAVARNSTD,mtfp,,495,468,,,,default,,,mtfp_default,,,,,,,,,,,b,,,,,,,,3OSEV
m,10.1038/nmeth.1209,ACD03281,,TagRFP-T,5JVA,,MVSKGEELIKENMHMKLYMEGTVNNHHFKCTSEGEGKPYEGTQTMRIKVVEGGPLPFAFDILATSFMYGSRTFINHTQGIPDFFKQSFPEGFTWERVTTYEDGGVLTATQDTSLQDGCLIYNVKIRGVNFPSNGPVMQKKTLGWEANTEMLYPADGGLEGRTDMALKLVGGGHLICNFKTTYRSKKPAKNLKMPGVYYVDHRLERIKEADKETYVEQHEVAVARYCDLPSKLGHKLNGMDELYK,tagrfp-t,33.21,584,555,81000,2.3,100.0,default,4.6,0.41,tagrfp-t_default,,,,,,,,,,,b,,,,,,,,LF3LJ
td,10.1038/nbt1037,AAV52169,3838287,tdTomato,,,MVSKGEEVIKEFMRFKVRMEGSMNGHEFEIEGEGEGRPYEGTQTAKLKVTKGGPLPFAWDILSPQFMYGSKAYVKHPADIPDYKKLSFPEGFKWERVMNFEDGGLVTVTQDSSLQDGTLIYKVKMRGTNFPPDGPVMQKKTMGWEASTERLYPRDGVLKGEIHQALKLKDGGHYLVEFKTIYMAKKPVQLPGYYYVDTKLDITSHNEDYTIVEQYERSEGRHHLFLGHGTGSTGSGSSGTASSEDNNMAVIKEFMRFKVRMEGSMNGHEFEIEGEGEGRPYEGTQTAKLKVTKGGPLPFAWDILSPQFMYGSKAYVKHPADIPDYKKLSFPEGFKWERVMNFEDGGLVTVTQDSSLQDGTLIYKVKMRGTNFPPDGPVMQKKTMGWEASTERLYPRDGVLKGEIHQALKLKDGGHYLVEFKTIYMAKKPVQLPGYYYVDTKLDITSHNEDYTIVEQYERSEGRHHLFLYGMDELYK,tdtomato,95.22,581,554,138000,,60.0,default,4.7,0.69,tdtomato_default,,,,,,,,,,,b,,,,,,,,PGG5S
wd,10.1038/nbt0102-87,,,Venus,1MYW,,MVSKGEELFTGVVPILVELDGDVNGHKFSVSGEGEGDATYGKLTLKLICTTGKLPVPWPTLVTTLGYGLQCFARYPDHMKQHDFFKSAMPEGYVQERTIFFKDDGNYKTRAEVKFEGDTLVNRIELKGIDFKEDGNILGHKLEYNYNSHNVYITADKQKNGIKANFKIRHNIEDGGVQLADHYQQNTPIGDGPVLLPDNHYLSYQSALSKDPNEKRDHMVLLEFVTAAGITLGMDELYK,venus,52.55,528,515,92200,3.0,17.6,default,6.0,0.57,venus_default,,,,,,,,,,,b,,,,,,,,YUJWJ
wd,10.1038/nbt1066,,,YPet,,,MVSKGEELFTGVVPILVELDGDVNGHKFSVSGEGEGDATYGKLTLKLLCTTGKLPVPWPTLVTTLGYGVQCFARYPDHMKQHDFFKSAMPEGYVQERTIFFKDDGNYKTRAEVKFEGDTLVNRIELKGIDFKEDGNILGHKLEYNYNSHNVYITADKQKNGIKANFKIRHNIEDGGVQLADHYQQNTPIGDGPVLLPDNHYLSYQSALFKDPNEKRDHMVLLEFLTAAGITEGMNELYK,ypet,80.08,530,517,104000,,,default,5.63,0.77,ypet_default,,,,,,,,,,,b,,,,,,,,AQACH
