agg,doi,genbank,ipg_id,name,pdb.0,seq,slug,states.0.brightness,states.0.em_max,states.0.ex_max,states.0.ext_coeff,states.0.lifetime,states.0.maturation,states.0.name,states.0.pka,states.0.qy,states.0.slug,switch_type,uniprot,uuid
m,10.1021/acs.biochem.0c00484,,,FusionRed-MQV,,MVSELIKENMPMKLYMEGTVNNHHFKCTSEGEGKPYEGTQTQRIKVVEGGPLPFAFDILATSFMYGSRTFIKHPPGIPDFFKQSFPEGFTWERVTTYEDGGVLTATQDTSLQDGCLIYNVKVRGVNFPANGPVMQKKTLGWEASTETMYPADGGLEGAVDMALKLVGGGHLICNMETTYRSKKPATNLKMPGVYNVDHRLERIKEADDETYVEQHEVAVARYSTGGAGDGGK,fusionred-mqv,76.32,585,566,144000,2.77,195.0,default,4.6,0.53,fusionred-mqv_default,b,,F35B7
m,10.1042/bj20081949,,,mKate2,,MVSELIKENMHMKLYMEGTVNNHHFKCTSEGEGKPYEGTQTMRIKAVEGGPLPFAFDILATSFMYGSKTFINHTQGIPDFFKQSFPEGFTWERVTTYEDGGVLTATQDTSLQDGCLIYNVKIRGVNFPSNGPVMQKKTLGWEASTETLYPADGGLEGRADMALKLVGGGHLICNLKTTYRSKKPAKNLKMPGVYYVDRRLERIKEADKETYVEQHEVAVARYCDLPSKLGHR,mkate2,25.0,633,588,62500,2.5,20.0,default,5.4,0.4,mkate2_default,b,,DBBO8
m,10.1038/nmeth.4045,AOY07814,,mMaroon1,,MVSKGEELIKENMHTKLYLTGTVNNHYFECTAEGEGKPYEGTQTNRIKVVRGGPLPFAFDILAPCFMYGSKTFINHPPDIPDYFKQSFPEGFTWERTTVYEDGGTLTATQDTSLQDGCLIYNVQVRGENFPSNGPVMQKKTLGWEASTETLYPADGSLEGRLDWALKLVGGGHLHCRLETTYRSKKPAKNLKMPGVYFIDRRLERIKEADNETYVEQHEVAVARYCDLPSKLGHKLNGMDELYK,mmaroon1,8.8,657,609,80000,,20.0,default,6.2,0.11,mmaroon1_default,b,,RATTD
m,10.1038/nmeth.2888,AHL19968,49083568,mNeptune2,,MVSKGEELIKENMHMKLYMEGTVNNHHFKCTSEGEGKPYEGTQTGRIKVVEGGPLPFAFDILATCFMYGSKTFINHTQGIPDFFKQSFPEGFTWERVTTYEDGGVLTVTQDTSLQDGCLIYNVKLRGVNFPSNGPVMQKKTLGWEASTETLYPADGGLEGRCDMALKLVGGGHLHCNLKTTYRSKKPAKNLKMPGVYFVDRRLERIKEADNETYVEQHEVAVARYCDLPSKLGHKLNGMDELYK,mneptune2,21.36,651,599,89000,,27.0,default,6.3,0.24,mneptune2_default,b,,VXEVZ
m,10.1016/j.chembiol.2013.08.008,AGX93076,44320375,mPapaya,,MVSKGEGQSKHGLKEEMTVKYHMEGCVNGHKFVITGEGIGNPFKGKQTANLCVIEGGPLPFSEDILSPGFKYGDRIFTEYPQDIVDYFKNSCPAGYTWERSYLFEDGAVCRCNVDITVSEKENCIYHKSIFRGVNFPADGPVMKKMTTNWEASTEKIVPVPKQGILKGKVKMCLLLKDGGRYHCQFDTVYKAKSVPSKMPEWHFIQHKLLREDRSDAKNQKWQLTEHAIAGMDELYK,mpapaya,35.69,541,530,43000,,,default,6.8,0.83,mpapaya_default,b,,5LCAQ
m,10.1038/srep20889,ATE88097,,mRuby3,,MVSKGEELIKENMRMKVVMEGSVNGHQFKCTGEGEGRPYEGVQTMRIKVIEGGPLPFAFDILATSFMYGSRTFIKYPADIPDFFKQSFPEGFTWERVTRYEDGGVVTVTQDTSLEDGELVYNVKVRGVNFPSNGPVMQKKTKGWEPNTEMMYPADGGLRGYTDIALKVDGGGHLHCNFVTTYRSKKTVGNIKMPGVHAVDHRLERIEESDNETYVVQREVAVAKYSNLGGGMDELYK,mruby3,57.6,592,558,128000,,136.5,default,4.8,0.45,mruby3_default,b,,MZMFB
m,10.1038/nmeth.4074,APD76535,129830964,mScarlet,5LK4,MVSKGEAVIKEFMRFKVHMEGSMNGHEFEIEGEGEGRPYEGTQTAKLKVTKGGPLPFSWDILSPQFMYGSRAFTKHPADIPDYYKQSFPEGFKWERVMNFEDGGAVTVTQDTSLEDGTLIYKVKLRGTNFPPDGPVMQKKTMGWEASTERLYPEDGVLKGDIKMALRLKDGGRYLADFKTTYKAKKPVQMPGAYNVDRKLDITSHNEDYTVVEQYERSEGRHSTGGMDELYK,mscarlet,70.0,594,569,100000,3.9,174.0,default,5.3,0.7,mscarlet_default,b,,FVS3D
t,10.1007/s10126-019-09931-9,AKM77632,,plobRFP,,MALSKQTGIQTEMKTKFHMEGIVNGHSFEVEGNGSGQPYEGVQKMKLTVTKGAPLPFSIDILLPQEMYGSKPFIKYPDNIPDYIKLSFPEGITWERTMTFEDGAVCTASNDSRLVGNCFIYEVKFQGVNFPRDGPVMQRKTKGWEPSTERLYEWDGCQRGDVDMALKLEDGGHYTVNFKTTYKSKKKDLKVPPYHFVDHKLELLSHNIVGTKEDFEQKETAHAHLSSLNSLNQ,plobrfp,62.16,614,578,84000,,,default,,0.74,plobrfp_default,b,,ESQ8O
td,10.1042/bj20081949,,,tdKatushka2,,MSELIKENMHMKLYMEGTVNNHHFKCTSEGEGKPYEGTQTMKIKVVEGGPLPFAFDILATSFMYGSKTFINHTQGIPDFFKQSFPEGFTWERITTYEDGGVLTATQDTSLQNGCIIYNVKINGVNFPSNGSVMQKKTLGWEANTEMLYPADGGLRGHSQMALKLVGGGYLHCSFKTTYRSKKPAKNLKMPGFHFVDHRLERIKEADKETYVEQHEMAVAKYCDLPSKLGHR,tdkatushka2,49.02,633,588,132500,,,default,5.4,0.37,tdkatushka2_default,b,,1L4BP
