agg,doi,genbank,ipg_id,name,pdb.0,seq,slug,states.0.brightness,states.0.em_max,states.0.ex_max,states.0.ext_coeff,states.0.lifetime,states.0.maturation,states.0.name,states.0.pka,states.0.qy,states.0.slug,switch_type,uniprot,uuid
d,10.1016/j.bbamcr.2018.08.015,MG727536,,BDFP1.6,,MANREVVETLKELLADGEKRVQVAGVIGTNAAEVVKTAVSLLFQEYPELVSPGGCAYTTRRYNMCVRDMNYFLRMCSYAIVAGGASVLDGRMLAGFRDTFNSLGIPLCPAARGIQLMKKIVKEKLATAGMTNIAFVDEPFDYIARVISETEI,bdfp16,19.7,666,642,100000,,,default,,0.197,bdfp16_default,b,,QNYK6
d,10.1016/j.bbamcr.2019.06.018,MK500863,,BDFP1.8,,MANREVVETLKELLADGEKRVQVAGVIGTNAAEVVKTAVSLLFQEYPELVSPGGCAYTTRRYNKCVRDMNYFLRMCSYAIVAGGASVLDGRMLAGLRDTFNSLGIPLGPVARGIQLMKKIVKEKLATAGMTNIAFVDEPFDYIARVISETEI,bdfp18,4.7,702,678,77027,,,default,2.0,0.061,bdfp18_default,b,,YEOJF
t,10.1021/bi900870u,AMO27221,,E2-Crimson,,MDSTENVIKPFMRFKVHMEGSVNGHEFEIEGVGEGKPYEGTQTAKLQVTKGGPLPFAWDILSPQFFYGSKAYIKHPADIPDYLKQSFPEGFKWERVMNFEDGGVVTVTQDSSLQDGTLIYHVKFIGVNFPSDGPVMQKKTLGWEPSTERNYPRDGVLKGENHMALKLKGGGHYLCEFKSIYMAKKPVKLPGYHYVDYKLDITSHNEDYTVVEQYERAEARHHLFQ,e2-crimson,28.98,646,611,126000,,24.0,default,4.5,0.23,e2-crimson_default,b,,VSU6B
m,10.1038/s41467-019-13897-6,MN701051,,emiRFP670,,MAEGSVARQPDLLTCEHEEIHLAGSIQPHGALLVVSEHDHRVIQASANAAEFLNLGSVLGVPLAEIDGDLLIKILPHLDPTAEGMPVAVRCRIGNPSTEYCGLMHRPPEGGLIIELERAGPSIDLSGTLAPALERIRTAGSLRALCDDTVLLFQQCTGYDRVMVYRFDEQGHGLVFSECHVPGLESYFGNRYPSSTVPQMARQLYVRQRVRVLVDVTYQPVPLEPRLSPLTGRDLDMSGCFLRSMSPCHLQFLKDMGVRATLAVSLVVGGKLWGLVVCHHYLPRFIRFELRAICKRLAERIATRITALES,emirfp670,12.24,670,642,87400,1.53,,default,4.5,0.14,emirfp670_default,b,,YHJV5
m,10.1038/s41467-019-13897-6,MN701053,,emiRFP703,,MAEGSVARQPDLLTCEHEEIHLAGSIQPHGALLVVSEHDHRVIQASANAAEFLNLGSVLGVPLAEIDGDLLIKILPHLDPTAEGMPVAVRCRIGNPSTEYCGLMHRPPEGGLIIELERAGPSIDLSGTLAPALERIRTAGSLRALCDDTVLLFQQCTGYDRVMVYRFDEQGHGLVFSECHVPGLESYFGNRYPSSLVPQMARQLYVRQRVRVLVDVTYQPVPLEPRLSPLTGRDLDMSGCFLRSMSPIHLQFLKDMGVRATLAVSLVVGGKLWGLVVCHHYLPRFIRFELRAICKRLAERIATRITALES,emirfp703,7.82,703,674,90900,,,default,4.5,0.086,emirfp703_default,b,,GNJK5
d,10.1038/ncomms4626,,,iFP2.0,4CQH,MARDPQPFFPPLYLGGPEITTENCEREPIHIPGSIQPHGALLTADGHSGEVLQVSLNAATFLGQEPTVLRGQTLAALLPDQWPALQTALPPGCQDALQYRATLDWPAAGHLSLTVHRVAELLILEFEPTEAWDSIGPHALRNAMFALESAPNLRALAEVATQTVRELSGFDRVMLYKFAPDATGEVIAEARREGMQAYLGHRFPASTTPAQARALYTRHLLRLTADTRAAAVPLDPVLNPQTNAPTPLGGAVLRATSPMHMQYLRNMGVGSSLSVSVVVGGQLWGLIVCHHQTPYVLPPDLRTTLEYLGRLLSLQVQRKEA,ifp20,6.88,711,690,86000,,,default,,0.08,ifp20_default,b,,B53TZ
d,10.1038/nmeth.2521,AGN32863,,iRFP670,,MARKVDLTSCDREPIHIPGSIQPCGCLLACDAQAVRITRITENAGAFFGRETPRVGELLADYFGETEAHALRNALAQSSDPKRPALIFGWRDGLTGRTFDISLHRHDGTSIIEFEPAAAEQADNPLRLTRQIIARTKELKSLEEMAARVPRYLQAMLGYHRVMLYRFADDGSGMVIGEAKRSDLESFLGQHFPASLVPQQARLLYLKNAIRVVSDSRGISSRIVPEHDASGAALDLSFAHLRSISPCHLEFLRNMGVSASMSLSIIIDGTLWGLIICHHYEPRAVPMAQRVAAEMFADFLSLHFTAAHHQR,irfp670,12.54,670,643,114000,,,default,4.0,0.11,irfp670_default,b,,Q5DYR
d,10.1038/nmeth.2521,AGN32864,,iRFP682,,MAEGSVARQPDLLTCDDEPIHIPGAIQPHGLLLALAADMTIVAGSDNLPELTGLAIGALIGRSAADVFDSETHNRLTIALAEPGAAVGAPITVGFTMRKDAGFIGSWHRHDQLIFLELEPPQRDVAEPQAFFRRTNSAIRRLQAAETLESACAAAAQEVRKITGFDRVMIYRFASDFSGVVIAEDRCAEVESKLGLHYPASAVPAQARRLYTINPVRIIPDINYRPVPVTPDLNPVTGRPIDLSFAILRSVSPCHLEFMRNIGMHGTMSISILRGERLWGLIVCHHRTPYYVDLDGRQACELVAQVLAWQIGVMEE,irfp682,9.9,682,663,90000,0.95,,default,4.5,0.11,irfp682_default,b,,N3G27
d,10.1038/nbt.1918,AEL88490,,iRFP713,,MAEGSVARQPDLLTCDDEPIHIPGAIQPHGLLLALAADMTIVAGSDNLPELTGLAIGALIGRSAADVFDSETHNRLTIALAEPGAAVGAPITVGFTMRKDAGFIGSWHRHDQLIFLELEPPQRDVAEPQAFFRRTNSAIRRLQAAETLESACAAAAQEVRKITGFDRVMIYRFASDFSGEVIAEDRCAEVESKLGLHYPASTVPAQARRLYTINPVRIIPDINYRPVPVTPDLNPVTGRPIDLSFAILRSVSPVHLEFMRNIGMHGTMSISILRGERLWGLIVCHHRTPYYVDLDGRQACELVAQVLAWQIGVMEE,irfp713,6.3,713,690,105000,,168.0,default,4.0,0.06,irfp713_default,b,,DGXFA
m,10.1038/nmeth.2888,AHL19967,49083567,mCardinal,4OQW,MVSKGEELIKENMHMKLYMEGTVNNHHFKCTTEGEGKPYEGTQTQRIKVVEGGPLPFAFDILATCFMYGSKTFINHTQGIPDFFKQSFPEGFTWERVTTYEDGGVLTVTQDTSLQDGCLIYNVKLRGVNFPSNGPVMQKKTLGWEATTETLYPADGGLEGRCDMALKLVGGGHLHCNLKTTYRSKKPAKNLKMPGVYFVDRRLERIKEADNETYVEQHEVAVARYCDLPSKLGHKLNGMDELYK,mcardinal,16.53,659,604,87000,,27.0,default,5.3,0.19,mcardinal_default,b,,7EWEM
m,10.1038/nmeth.3447,,,mIFP,,MSVPLTTSAFGHAFLANCEREQIHLAGSIQPHGILLAVKEPDNVVIQASINAAEFLNTNSVVGRPLRDLGGDLPLQILPHLNGPLHLAPMTLRCTVGSPPRRVDCTIHRPSNGGLIVELEPATKTTNIAPALDGAFHRITSSSSLMGLCDETATIIREITGYDRVMVVRFDEEGNGEILSERRRADLEAFLGNRYPASTIPQIARRLYEHNRVRLLVDVNYTPVPLQPRISPLNGRDLDMSLSCLRSMSPIHQKYMQDMGVGATLVCSLMVSGRLWGLIACHHYEPRFVPFHIRAAGEALAETCAIRIATLESFAQSQSK,mifp,6.56,704,683,82000,,,default,3.5,0.08,mifp_default,b,,LDVKW
m,10.1038/s41589-018-0004-9,MG250278.1,,miRFP,,MVAGHASGSPDFGTADPSDCEREEIHLAGSIQPHGTLLVVSEPDHRIIQASANAAEFLNLGSVLGVPLAEIDGDLLIKILPHLDPTAEGMPVAVRCRIGNPSTEYDGLMHRPPEGGLIIELERAGPPIDLSGTLAPALERIRTAGSLRALCDDTALLFQQCTGYDRVMVYRFDEQGHGEVYSEIHVTGLESYFGNRYPSSLVPQMARRLYERQRVRVLVDVSYQPVPLEPRLSPLTGRDLDMSGCFLRSMSPTHLQFLKNMGVRATLVVSLVVGGKLWGLVICHHYLPRFIHFELRAICELLAEAIATRITAL,mirfp,8.96,703,674,92400,,,default,4.3,0.097,mirfp_default,b,,HO9GG
m,10.1101/2021.08.02.454744,MZ682639,,miRFP2,,MVAGHASGSPDFGTASPSDCEHEEIHLAGSIQPHGTLLVVSEPDHRIIQASANAAEFLNLGSVLGIPLAEIDGDLLIKILPHLDLTAEGMPVAVRCRIGNPSTEYDGLMHRPPEGGLIIELERAGPSIDLSGTLAPALERIRTAGSLRALCDDTVLLFQQCTGYDRVMVYRFDERGHGEVYSEIHVTGLESYFGNRYPSSLVPQMARRLYVRQRVRVLVDVTYQPVPLEPRLSPLTGRDLDMSGCFLRSMSPTHLQFLKNMGVRATLVVSLVVGGKLWGLVICHHYLPRFIHFELRAICVLLAEAIATRITAL,mirfp2,2.39,706,676,55600,,,default,3.7,0.043,mirfp2_default,b,,AYRSR
m,10.1038/ncomms12405,AOD74926,,miRFP670,,MVAGHASGSPAFGTASHSNCEHEEIHLAGSIQPHGALLVVSEHDHRVIQASANAAEFLNLGSVLGVPLAEIDGDLLIKILPHLDPTAEGMPVAVRCRIGNPSTEYCGLMHRPPEGGLIIELERAGPSIDLSGTLAPALERIRTAGSLRALCDDTVLLFQQCTGYDRVMVYRFDEQGHGLVFSECHVPGLESYFGNRYPSSTVPQMARQLYVRQRVRVLVDVTYQPVPLEPRLSPLTGRDLDMSGCFLRSMSPCHLQFLKDMGVRATLAVSLVVGGKLWGLVVCHHYLPRFIRFELRAICKRLAERIATRITALES,mirfp670,12.24,670,642,87400,1.42,180.0,default,4.5,0.14,mirfp670_default,b,,DP999
m,10.1038/s41467-019-13897-6,,,miRFP670-2,,MARKVDLTSCDREPIHIPGSIQPCGCLLACDAQAVRITRITENAGAFFGRETPRVGELLADYFGETEAHALRNALAQSSDPKRPALIFGWRDGLTGRTFDISLHRHDGTSIIEFEPAAAEQADNPLRLTRQIIARTKELKSLEEMAARVPRYLQAMLGYHRVMLYRFADDGSGMVIGEAKRSDLESFLGQHFPASLVPQQARLLYLKNAIRVVSDSRGISSRIVPEHDASGAALDLSFAHLRSISPCHLEFLRNMGVSASMSLSIIIDGTLWGLIICHHYEPRAVPMAQRVAAKRFAERLSTHFTAAHHQR,mirfp670-2,14.01,670,643,103000,1.42,,default,4.5,0.136,mirfp670-2_default,b,,1KUE6
m,10.1038/s41467-018-08050-8,MK176509,,miRFP670nano,6MGH,MANLDKMLNTTVTEVRQFLQVDRVCVFQFEEDYSGVVVVEAVDDRWISILKTQVRDRYFMETRGEEYSHGRYQAIADIYTANLTECYRDLLTQFQVRAILAVPILQGKKLWGLLVAHQLAAPRQWQTWEIDFLKQQAVVVGIAIQQS,mirfp670nano,10.26,670,645,95000,,100.0,default,3.7,0.108,mirfp670nano_default,b,,1KNNM
m,10.1038/s41467-019-13897-6,MN701052,,miRFP680,,MAEGSVARQPDLLTCDDEPIHIPGAIQPHGLLLALAADMTIVAGSDNLPELTGLAIGALIGRSAADVFDSETHNRLTIALAEPGAAVGAPITVGFTMRKDAGFIGSWHRHDQLIFLELEPPQRDVAEPQAFFRRTNSAIRRLQAAETLESACAAAAQEVRKITGFDRVMIYRFASDFSGEVIAEDRCAEVESKLGLHYPASTVPAQARRLYTINPVRIIPDINYRPVPVTPDLNPVTGRPIDLSFAILRSVSPCHLEFMRNIGMHGTMSISILRGERLWGLIVCHHRTPYYVDLDGRQACKRVAERLATQIGVMEE,mirfp680,13.63,680,661,94000,1.67,,default,4.5,0.145,mirfp680_default,b,,RAKQZ
m,10.1038/ncomms12405,,,miRFP703,,MVAGHASGSPAFGTASHSNCEHEEIHLAGSIQPHGALLVVSEHDHRVIQASANAAEFLNLGSVLGVPLAEIDGDLLIKILPHLDPTAEGMPVAVRCRIGNPSTEYCGLMHRPPEGGLIIELERAGPSIDLSGTLAPALERIRTAGSLRALCDDTVLLFQQCTGYDRVMVYRFDEQGHGLVFSECHVPGLESYFGNRYPSSLVPQMARQLYVRQRVRVLVDVTYQPVPLEPRLSPLTGRDLDMSGCFLRSMSPIHLQFLKDMGVRATLAVSLVVGGKLWGLVVCHHYLPRFIRFELRAICKRLAERIATRITALES,mirfp703,7.82,703,674,90900,,,default,4.5,0.086,mirfp703_default,b,,1B7TK
m,10.1038/ncomms12405,,,miRFP709,,MVAGHASGSPAFGTASHSNCEHEEIHLAGSIQPHGALLVVSEHDHRVIQASANAAEFLNLGSVLGVPLAEIDGDLLIKILPHLDPTAEGMPVAVRCRIGNPSTEYCGLMHRPPEGGLIIELERAGPSIDLSGTLAPALERIRTAGSLRALCDDTVLLFQQCTGYDRVMVYRFDEQGHGLVFSECHVPGLESYFGNRYPSSFIPQMARQLYVRQRVRVLVDVTYQPVPLEPRLSPLTGRDLDMSGCFLRSMSPIHLQFLKDMGVRATLAVSLVVGGKLWGLVVCHHYLPRFIRFELRAICKRLAERIATRITALES,mirfp709,4.23,709,683,78400,,,default,4.5,0.054,mirfp709_default,b,,Q6V69
m,10.1038/s41467-019-13897-6,MN701054,,miRFP713,,MAEGSVARQPDLLTCDDEPIHIPGAIQPHGLLLALAADMTIVAGSDNLPELTGLAIGALIGRSAADVFDSETHNRLTIALAEPGAAVGAPITVGFTMRKDAGFIGSWHRHDQLIFLELEPPQRDVAEPQAFFRRTNSAIRRLQAAETLESACAAAAQEVRKITGFDRVMIYRFASDFSGEVIAEDRCAEVESKLGLHYPASTVPAQARRLYTINPVRIIPDINYRPVPVTPDLNPVTGRPIDLSFAILRSVSPVHLEFMRNIGMHGTMSISILRGERLWGLIVCHHRTPYYVDLDGRQACKRVAERLATQIGVMEE,mirfp713,6.93,713,690,99000,0.89,,default,3.5,0.07,mirfp713_default,b,,2EG15
m,10.1038/s41589-018-0044-1,,,miRFP720,,MAEGSVARQPDLLTCDDEPIHIPGAIQPHGLLLALAADMTIVAGSDNLPELTGLAIGALIGRSAADVFDSETHNRLTIALAEPGAAVGAPITVGFTMRKDAGFIGSWHRHDQLIFLELEPPQRDVAEPQAFFRRTNSAIRRLQAAETLESACAAAAQEVRKITGFDRVMIYRFASDFSGEVIAEDRCAEVESKLGLHYPASFIPAQARRLYTINPVRIIPDINYRPVPVTPDLNPVTGRPIDLSFAILRSVSPVHLEFMRNIGMHGTMSISILRGERLWGLIVCHHRTPYYVDLDGRQACKRVAERLATQIGVMEE,mirfp720,5.98,720,702,98000,,,default,4.5,0.061,mirfp720_default,b,,AJLWS
m,10.1038/nmeth.4045,AOY07814,,mMaroon1,,MVSKGEELIKENMHTKLYLTGTVNNHYFECTAEGEGKPYEGTQTNRIKVVRGGPLPFAFDILAPCFMYGSKTFINHPPDIPDYFKQSFPEGFTWERTTVYEDGGTLTATQDTSLQDGCLIYNVQVRGENFPSNGPVMQKKTLGWEASTETLYPADGSLEGRLDWALKLVGGGHLHCRLETTYRSKKPAKNLKMPGVYFIDRRLERIKEADNETYVEQHEVAVARYCDLPSKLGHKLNGMDELYK,mmaroon1,8.8,657,609,80000,,20.0,default,6.2,0.11,mmaroon1_default,b,,RATTD
m,10.1016/j.chembiol.2009.10.009,ACZ95826,19025958,mNeptune,,MVSKGEELIKENMHMKLYMEGTVNNHHFKCTSEGEGKPYEGTQTGRIKVVEGGPLPFAFDILATCFMYGSKTFINHTQGIPDFFKQSFPEGFTWERVTTYEDGGVLTATQDTSLQDGCLIYNVKIRGVNFPSNGPVMQKKTLGWEASTETLYPADGGLEGRCDMALKLVGGGHLICNLKTTYRSKKPAKNLKMPGVYFVDRRLERIKEADKETYVEQHEVAVARYCDLPSKLGHKLNGMDELYK,mneptune,13.4,650,600,67000,,35.0,default,5.4,0.2,mneptune_default,b,,1LT8G
m,10.1038/nmeth.2888,AHL19969,49083569,mNeptune2.5,,MVSKGEELIKENMHTKLYMEGTVNNHHFKCTHEGEGKPYEGTQTNRIKVVEGGPLPFAFDILATCFMYGSKTFINHTQGIPDFFKQSFPEGFTWERVTTYEDGGVLTVTQDTSLQDGCLIYNVKLRGVNFPSNGPVMQKKTLGWEASTETLYPADGGLEGRCDMALKLVGGGHLHCNLKTTYRSKKPAKNLKMPGVYFVDRRLERIKEADNETYVEQHEVAVARYCDLPSKLGHKLNGMDELYK,mneptune25,22.8,643,599,95000,,26.0,default,5.8,0.24,mneptune25_default,b,,OADBJ
m,10.1038/s41598-019-52123-7,,,mRhubarb713,,MAEGSVARQPDLLTCDDEPIHIPGAIQPHGLLLALAADMTIVAGSDNLPELTGLAIGALIGRSAADVFDSETHNRLTIALAEPGAAVGAPITVGFTMRKDAGFIGSWHRHDQLIFLELEPPQRDVAEPQAFFRHTNSAIRRLQAAETLESACAAAAQEVRKITGFDRVMIYRFASDFSGEVIAEDRCAEVESKLGLHYPASTVPAQARRLYTINPVRIIPDINYRPVPVTPDLNPVTGRPIDLSFAILRSVSPVHLEFMRNIGMHGTMSISILRGERLWGLIVCHHRTPYYVDLDGRQACELVAQVLARAIGVMEE,mrhubarb713,8.66,713,690,113457,,,Pr,,0.0763,mrhubarb713_pr,b,,OZEBT
m,10.1038/s41598-019-52123-7,,,mRhubarb719,,MAEGSVARQPDLLTCDDEPIHIPGAIQPHGLLLALAADMTIVAGSDNLPELTGLAIGALIGRSAADVFDSETHNRLTIALAEPGAAVGAPITVGFTMRKDAGFIGSWHRHDQLIFLELEPPQRDVAEPQAFFRHTNSAIRRLQAAETLESACAAAAQEVRKITGFDRVMIYRFASDFSGEVIAEDRCAEVESKLGLHSPASYIPAQARRLYTINPVRIIPDINYRPVPVTPDLNPVTGRPIDLSFAILRSVSPVHLEFMRNIGMHGTMSISILRGERLWGLIVCHHRTPYYVDLDGRQACELVAQVLARAIGVMEE,mrhubarb719,5.7,719,700,83768,,,Pr,,0.068,mrhubarb719_pr,b,,TUP2T
m,10.1038/s41598-019-52123-7,,,mRhubarb720,,MAEGSVARQPDLLTCDDEPIHIPGAIQPHGLLLALAADMTIVAGSDNLPELTGLAIGALIGRSAADVFDSETHNRLTIALAEPGAAVGAPITVGFTMRKDAGFIGSWHRHDQLIFLELEPPQRDVAEPQAFFRHTNSAIRRLQAAETLESACAAAAQEVRKITGFDRVMIYRFASDFSGEVIAEDRCAEVESKLGQHYPASDIPAQARRLYTINPVRIIPDINYRPVPVTPDLNPVTGRPIDLSFAILRSVSPVHLEFMRNIGMHGTMSISILRGERLWGLIVCHHRTPYYVDLDGRQACELVAQVLARAIGVMEE,mrhubarb720,6.13,720,701,94941,,,Pr,,0.0646,mrhubarb720_pr,b,,PV8DK
d,10.1038/nmeth.3935,KX449134,ANW47198.1,smURFP,6FZN,MAKTSEQRVNIATLLTENKKKIVDKASQDLWRRHPDLIAPGGIAFSQRDRALCLRDYGWFLHLITFCLLAGDKGPIESIGLISIREMYNSLGVPVPAMMESIRCLKEASLSLLDEEDANETAPYFDYIIKAMS,smurfp,32.4,670,642,180000,1.4,39.0,default,3.2,0.18,smurfp_default,b,,HGBNQ
m,10.1038/s41467-018-07246-2,AYH52606,212327017,SNIFP,,MSRDPLPFFPPLYLGGPEITTENCEREPIHIPGSIQPHGALLTADGHSGEVLQMSLNAATFLGQEPTVLRGQTLAALLPEQWPALQAALPPGCPDALQYRATLDWPAAGHLSLTVHRVGELLILEFEPTEAWDSTGPHALRNAMSALESAPNLRALAEVATQTVRELTGFDRVMLYKFAPDATGEVIAEARREGLHAFLGHRFPASLIPAQARALYTRHLLRLTADTRAAAVPLDPVLNPQTNAPTPLGGAVLRATSPMHMQFLRNMGVRSSLSVSVVVGGQLWGLIACHHQTPYVLPPDLRTTLEYLGRELSEQVQVKE,snifp,3.28,720,697,149200,0.63,,default,,0.022,snifp_default,b,,Q5F5J
m,10.1016/j.bpj.2010.04.025,,,TagRFP657,,MSELITENMHMKLYMEGTVNNHHFKCTSEGEGKPYEGTQTQRIKVVEGGPLPFAFDILATSFMYGSHTFINHTQGIPDFWKQSFPEGFTWERVTTYEDGGVLTATQDTSLQDGCLIYNVKIRGVNFPSNGPVMQKKTLGWEAHTEMLYPADGGLEGRTALALKLVGGGHLICNFKTTYRSKKPAKNLKMPGVYYVDYRLERIKEADKETYVEQHEVAVARYCDLPSKLGHKLN,tagrfp657,3.4,657,611,34000,,125.0,default,5.0,0.1,tagrfp657_default,b,,C2N5S
m,10.1101/2021.08.02.454744,MZ682638,,TagRFP658,,MSELIKENMHMKLYMEGTVNNHHFKCTSEGEGKPYEGTQTQRIKVVEGGPLPFAFDILATSFMYGSHTFIDHTQGIPDFWKQSFPEGFTWERVTTYEDGGVLTATQDTSLHDGCLIYNVKIRGVNFPSNGPVMQKKTLGWEAHTEMLYPTDGGLEGRTALALKLVGGGHLICNFKTIYRSKKPAKNLKMPGVYYVDYRLERIEEADNETYVEQHEVAVARYCDLPTKLGHKLN,tagrfp658,4.12,658,611,41200,,,default,4.6,0.1,tagrfp658_default,b,,AJJAK
m,10.1074/jbc.m111.295121,,,Wi-Phy,3S7Q,MASMTGGQQMGRGSMSRDPLPFFPPLYLGGPEITTENCEREPIHIPGSIQPHGALLTADGHSGEVLQMSLNAATFLGQEPTVLRGQTLAALLPEQWPALQAALPPGCPDALQYRATLDWPAAGHLSLTVHRVGELLILEFEPTEAWDSTGPHALRNAMSALESAPNLRALAEVATQTVRELTGFDRVMLYKFAPDATGEVIAEARREGLHAFLGHRFPASHIPAQARALYTRHLLRLTADTRAAAVPLDPVLNPQTNAPTPLGGAVLRATSPMHMQFLRNMGVGSSLSVSVVVGGQLWGLIACHHQTPYVLPPDLRTTLEYLGRELSEQVQVKEA,wi-phy,4.37,719,701,92991,,,default,,0.047,wi-phy_default,b,,V6A1P
