agg,doi,genbank,ipg_id,name,pdb.0,pdb.1,seq,slug,states.0.brightness,states.0.em_max,states.0.ex_max,states.0.ext_coeff,states.0.lifetime,states.0.maturation,states.0.name,states.0.pka,states.0.qy,states.0.slug,states.1.brightness,states.1.em_max,states.1.ex_max,states.1.ext_coeff,states.1.lifetime,states.1.maturation,states.1.name,states.1.pka,states.1.qy,states.1.slug,switch_type,transitions.0.from_state,transitions.0.to_state,transitions.0.trans_wave,transitions.1.from_state,transitions.1.to_state,transitions.1.trans_wave,uniprot,uuid
d,10.1101/677344,,,AausFP1,,,MSYGALLFREKIPYVVEMEGDVEGMKFSVRGKGHGDANTGKIEASFICTTGELPVPWSSILTTVTYGAQCFAKYPNDIKDYPKSAMPEGYVQERTITFENDGVYKTRAEVTYEKGSVYNRVTLNGSGFKKGGNILGKKLEFNYNPHCIYVLPDVQNNGIKCYINIVHDVIGGGQIIAAHQQLNTPLGGGPVDIPHYHHIQAHTILSKDPKETRDHMNVVEVFRAIDCKTAYA,aausfp1,164.9,510,504,170000,,,default,4.4,0.97,aausfp1_default,,,,,,,,,,,b,,,,,,,,C2FJQ
,10.1002/jemt.20410,AAU06849,3620749,amilFP490,,,MSYSKQGIAQVMKTKYHMEGSVNGHEFTIEGVGTGNPYEGTQMSELVITKPAGKPLPFSFDILSTVFQYGNRCFTKYPEGMTDYFKQAFPDGMSFERSFLYEDGGVATASWNIRLERDCFIHKSIYHGVNFPADGPVMKKKTIGWDKAFEKMTVSKDVLRGDVTEFLMLEGGGYHSCQFHSTYKPEKPVTLPPNHVVEHHIVRTDLGQTAKGFTVKLEEHAAAHVNPLKVQ,amilfp490,26.55,490,424,29500,,,default,,0.9,amilfp490_default,,,,,,,,,,,b,,,,,,,Q66PV5,VAXZZ
d,10.1038/srep05469,,,bfloGFPa1,,,MPLPATHDIHLHGSINGHEFDMVGGGKGDPNAGSLVTTAKSTKGALKFSPYLMIPHLGYGYYQYLPYPDGPSPFQTSMLEGSGYAVYRVFDFEDGGKLTTEFKYSYEGSHIKADMKLMGSGFPDDGPVMTSQIVDQDGCVSKKTYLNNNTIVDSFDWSYNLQNGKRYRARVSSHYIFDKPFSADLMKKQPVFVYRKCHVKASKTEVTLDEREKAFYELA,bflogfpa1,120.9,512,500,120900,,,default,3.0,1.0,bflogfpa1_default,,,,,,,,,,,b,,,,,,,,6BXQP
d,10.1038/nmeth.2413,,,dLanYFP,,,MVSKGEEDNMASLPATHELHIFGSFNGVDFDMVGRGTGNPNDGYEELNLKSTKGDLQFSPWILVPQIGYGFHQYLPFPDGMSPFQAAMKDGSGYQVHRTMQFEDGASLTSNYRYTYEGSHIKGEFQVKGTGFPADGPVMTNSLTAADWCVTKMLYPNDKTIISTFDWTYTTGNGKRYQSTARTTYTFAKPMAANILKNQPMFVFRKTELKHSKTELNFKEWQKAFTDVMGMDELYK,dlanyfp,112.5,524,513,125000,3.1,,default,3.9,0.9,dlanyfp_default,,,,,,,,,,,b,,,,,,,,SKHT2
d,10.1111/j.1742-4658.2010.07618.x,,,dVFP,,,MNVIKPDMRIKLRMEGAVNGHKFVILGDGNGKPYEGTQTIDVTVKEGGPLPFAYDILTSAFQYGNRVFTKYPDDIADYFKQSFPVGYSWERSMTYEDGGICTVSSDIKMEGNSFIYEIRFHGLNFPSDGPVMQKKTVKWEPSTEKMYVRDGVLKGDVNMALLLEGGGHYRCDFKSTYKAKRAVQLPDYHYIDHRIEILSHDKDYNKVKLCENAAARCSMLPSQAK,dvfp,107.0,503,491,107000,,,default,,1.0,dvfp_default,,,,,,,,,,,b,,,,,,,,2DB3H
m,10.1016/j.chembiol.2017.12.005,BBC28144,174808012,Gamillus,5Y01,5Y00,MVSKGEEASGRALFQYPMTSKIELNGEINGKKFKVAGEGFTPSSGRFNMHAYCTTGDLPMSWVVIASPLQYGFHMFAHYPEDITHFFQECFPGSYTLDRTLRMEGDGTLTTHHEYSLEDGCVTSKTTLNASGFDPKGATMTKSFVKQLPNEVKITPHGPNGIRLTSTVLYLKEDGTIQIGTQDCIVTPVGGRKVTQPKAHFLHTQIIQKKDPNDTRDHIVQTELAVAGNLWHGMDELYK,gamillus,74.7,519,504,83000,,8.0,On,3.4,0.9,gamillus_on,,,,,,,Off,,,gamillus_off,ps,gamillus_on,gamillus_off,488,gamillus_off,gamillus_on,388,,21PQ5
d,10.1016/j.chembiol.2017.12.005,,,Gamillus0.2,,,MASGRALFQYPMTSKIELNGEINGKKFKVAGEGFTPNSGRFNMHAYCTTGDLPMSWVVIASPLQYGFHMFAHYPEDITHFFQECFPGSYTLDRTLRMEGDGTLTTHHEYSLKDGCVTSKTTLNASGFDPKGATMTKSFVEQLPNQVEITAEGNGIRLTSTVLYLKKDGTIQIGRQDCIVKPVGGKKVTQPKAHFLHTQIIQKKDPNDTRDHIVQTELAVAGNPWHEPSASAV,gamillus02,51.7,524,505,55000,,,default,4.0,0.94,gamillus02_default,,,,,,,,,,,b,,,,,,,,WLNHW
m,10.1007/s10126-006-6006-8,AAL33914,1124407,GFPxm163,,,MSKGEELFTGIVPVLIELDGDVHGHKFSVRGEGEGDADYGKLEIKFICTTGKLPVPWPTLVTTLGYGIQCFARYPEHMKMNDFFKSAMPEGYIQERTIFFQDDGKYKTRGEVKFEGDTLVNRIELKGMDFKEDGNILGHKLEYNFNSHNVYIMPDKANNGLKVNFKIRHNIEGGGVQLADHYQTNVPLGDGPVLIPINHYLSYQTAISKDRNETRDHMVFLEFFSACGHTHGMDELYK,gfpxm163,,523,512,,,,default,,1.0,gfpxm163_default,,,,,,,,,,,b,,,,,,,Q8WTC8,5M9ZL
m,10.1007/s10126-006-6006-8,AAK02064,366167,GFPxm18,,,MSKGEELFTGIVPVLIELDGDVHGHKFSVRGEGEGDADYGKLEIKFICTTGKLPVPWPTLVTTLAYGIQCFARYPEHMKMNDFFKSAMPEGYIQERTIFFQDDGKYKTRGEVKFEGDTLVNRIELKGMDFKEDGNILGHKLEYNFNSHNVYIMPDKANNGLKVNFKIRHNIEGGGVQLADHYQTNVPLGDGPVLIPINHYLSTQTAISKDRNETRDHMVFLEFFSACGHTHGMDELYK,gfpxm18,,502,472,,,,default,,0.96,gfpxm18_default,,,,,,,,,,,b,,,,,,,,PLVQM
m,10.1371/journal.pone.0095808,,,iq-mCerulean3,,,,iq-mcerulean3,25.12,474,433,27300,,,default,,0.92,iq-mcerulean3_default,,,,,,,,,,,b,,,,,,,,PX32J
t,10.1038/nmeth.2413,ACA48232,14640227,LanYFP,5LTQ,,MSLPATHELHIFGSFNGVDFDMVGRGTGNPNDGYEELNLKSTKGALQFSPWILVPQIGYGFHQYLPFPDGMSPFQAAMKDGSGYQVHRTMQFEDGASLTSNYRYTYEGSHIKGEFQVIGTGFPADGPVMTNSLTAADWCVTKMLYPNDKTIISTFDWTYTTGSGKRYQSTVRTNYTFAKPMAANILKNQPMFVFRKTELKHSKTELNFKEWQKAFTDVM,lanyfp,142.5,524,513,150000,,,default,3.5,0.95,lanyfp_default,,,,,,,,,,,b,,,,,,,B1PNC0,WK5F6
d,10.1042/bj20040321,BAD24723,3504960,MiCy,,,MVSYSKQGIAQEMRTKYRMEGSVNGHEFTIEGVGTGNPYEGKQMSELVIIKSKGKPLPFSFDILSTAFQYGNRCFTKYPADMPDYFKQAFPDGMSYERSFLFEDGGVATASWSIRLEGNCFIHNSIYHGVNFPADGPVMKKQTIGWDKSFEKMSVAKEVLRGDVTQFLLLEGGGYQRCRFHSTYKTEKPVAMPPSHVVEHQIVRTDLGQTAKGFKVKLEEHAEAHVNPLKVK,micy,24.52,495,472,27250,3.4,,default,6.6,0.9,micy_default,,,,,,,,,,,b,,,,,,,Q6I7B1,T7XX8
t,10.1371/journal.pone.0002680,ABB17965,4901536,mmilCFP,,,MALPKQMKLTYHMEGTVNGHFFIIKGEGGGEPYEGTHTIKLQVVEGSPLPFSPDILSTVFQYGNRCFTKYPPNIVDYFKNSCSGGGYTFGRSFLYEDGAVCTASGDITLSSDKSSFEHKSKFLGVNFPADGPVMKKETTNWEPSCEKMTPNGMTLIGDVTEFLLKKDGKRYKCQFHTFHDAKEKSRNMPMPDFHFVQHEIERKDLPGPMQTWQLTEHAAACKNCFTE,mmilcfp,38.25,492,404,42500,,,default,,0.9,mmilcfp_default,,,,,,,,,,,b,,,,,,,A8CLU7,QB1DP
m,10.1038/ncomms1738,,,mTurquoise2,3ZTF,,MVSKGEELFTGVVPILVELDGDVNGHKFSVSGEGEGDATYGKLTLKFICTTGKLPVPWPTLVTTLSWGVQCFARYPDHMKQHDFFKSAMPEGYVQERTIFFKDDGNYKTRAEVKFEGDTLVNRIELKGIDFKEDGNILGHKLEYNYFSDNVYITADKQKNGIKANFKIRHNIEDGGVQLADHYQQNTPIGDGPVLLPDNHYLSTQSKLSKDPNEKRDHMVLLEFVTAAGITLGMDELYK,mturquoise2,27.9,474,434,30000,4.0,33.5,default,3.1,0.93,mturquoise2_default,,,,,,,,,,,b,,,,,,,,7AV5G
t,10.1371/journal.pone.0002680,ACD13194,14926075,plamGFP,,,MEIEDVIKRDMKIKLRMEGAVNGHKFVIIGNGDGKPYEGTQTIDLEVIEGAPLPFAFDILTTVFEYGNRVFAKYPNEIVDYFKQSFPEGYSWERSMTYEDGGICIATNNITLSKVIDNCFHYNIRFDGVNFPPKSPVLQKTTMKWEPSTEIMYVRDGVLKGDVNMALLIEGGGHYRCDFKTIYKAKKVVELPDYHFVDHRITIKSHDKDYNKVLLHEHAKARYGLQRKAK,plamgfp,94.66,514,502,98600,,,default,,0.96,plamgfp_default,,,,,,,,,,,b,,,,,,,B6CTZ5,4UCC6
t,10.1371/journal.pone.0011517,ACT99046,18218400,pmimGFP1,,,MPNMKLECRISGTMNGEEFELVGNGDGNTDEGRMTNKMKSTKGPLSFSPYLLSHVLGYGYYHYATFPAGYENVYLHAMKNGGYSNTRTERYEDGGIISATFNYRYEGDKIIGDFKVVGTGFPTNSIIFTDKIIKSNPTCEHIYPKADNILVNAYTRTWMLRDGGYYSAQVNNHMHFKSAIHPTMLQNGGSMFTYRKVEELHTQTEVGIVEYQHVFKTPTAFA,pmimgfp1,72.68,505,491,79000,,,default,5.3,0.92,pmimgfp1_default,,,,,,,,,,,b,,,,,,,D2IGW0,OW4TY
t,10.1371/journal.pone.0011517,ACT99047,18218401,pmimGFP2,,,MPNMKLECRISGTMNGEEFKLVGAGEGNTDEGRMTNKVKSTKGPLPFSPYLLSHVLGYGYYHYATFPAGYENVYLHAMKNGGYSNTRTERYEDGGIISATFNYRYEGDKIIGDFKVVGTGFPTNSIIFTDKIIKSNPTCEHIYPKADNILVNAYTRTWMLRDGGYYSAQVNNHMHFKSAIHPTMLQNGGSMFTYRKVEELHTQTEVGIVEYQHVFKRPTAFA,pmimgfp2,72.68,505,491,79000,,,default,4.7,0.92,pmimgfp2_default,,,,,,,,,,,b,,,,,,,D2IGW1,U97V7
t,10.1371/journal.pone.0002680,ACD13191,14926072,psamCFP,,,MASTKNVLPNMMTLTYHMEGSVNGHNFEIIGEGTGNPKEGKHTITLQVVKGGPLPFSVDILSTVFQYGNRCFTKYPPNTVDYFKNSCPPGYTFERSFLYEDGAVCTASGDITLSDDKASFHHKSKFFGVNFPDDGPVMKKKTTDWEPSCEKMTPSGKTLKGDVIEFLLLEGGGRYKCQFHTVYRAKTEPKRMPEFHFVQHKLTRTDVSDPLKQQWQLTEDAAACESCFHK,psamcfp,29.57,492,404,30800,,,default,,0.96,psamcfp_default,,,,,,,,,,,b,,,,,,,B6CTZ2,U69HK
t,10.1371/journal.pone.0002680,ACD13195,14926076,sarcGFP,,,MSVIKQEMKIKLHMDGNVNGHAFVIEGDGKGKPYDGTQTLNLSVKEGAPLPFSYDILTNAFQYGNRAFTKYPADIPDYFKQTFPEGYSWERTMSYEDNAICNVRSEISMEGDCFIYKIRFDGKNFPPNGPVMQKKTLKWEPSTEMMYARDGFLMGDVNMALLLEGGGHHRCDFKTSYKAAKKNVQLPDYHYVDHRIEILSHDRDYNKVKLYENAVARYSLLPSQA,sarcgfp,73.63,500,483,76700,,,default,,0.96,sarcgfp_default,,,,,,,,,,,b,,,,,,,B6CTZ6,1BEMJ
d,10.1111/j.1742-4658.2010.07618.x,CBI12485,19026071,VFP,,,MNVIKPDMRIKLRMEGAVNGHKFVILGDGNGKPYEGTQTIDVTVKEGGPLPFAYDILTSAFQYGNRVFTKYPDDIADYFKQSFPVGYSWERSMTYEDGGICTVSSDIKMEGNSFIYEIRFHGLNFPSDGPVMQKKTVKWEPSTEKMYVRDGVLKGDVNMTLLLEGGGHYRCDFKSTYKAKRAVQLPDYHYIDHRIEILSHDKDYNKVKLCENAAARCSMLPSQAK,vfp,83.7,503,491,83700,,,default,,1.0,vfp_default,,,,,,,,,,,b,,,,,,,D1J6P8,P3DVP
