agg,doi,genbank,ipg_id,name,pdb.0,pdb.1,seq,slug,states.0.brightness,states.0.em_max,states.0.ex_max,states.0.ext_coeff,states.0.lifetime,states.0.maturation,states.0.name,states.0.pka,states.0.qy,states.0.slug,switch_type,uniprot,uuid
m,10.1038/nmeth.2888,AHL19967,49083567,mCardinal,4OQW,,MVSKGEELIKENMHMKLYMEGTVNNHHFKCTTEGEGKPYEGTQTQRIKVVEGGPLPFAFDILATCFMYGSKTFINHTQGIPDFFKQSFPEGFTWERVTTYEDGGVLTVTQDTSLQDGCLIYNVKLRGVNFPSNGPVMQKKTLGWEATTETLYPADGGLEGRCDMALKLVGGGHLHCNLKTTYRSKKPAKNLKMPGVYFVDRRLERIKEADNETYVEQHEVAVARYCDLPSKLGHKLNGMDELYK,mcardinal,16.53,659,604,87000,,27.0,default,5.3,0.19,mcardinal_default,b,,7EWEM
m,10.1038/s41589-018-0004-9,MG250278.1,,miRFP,,,MVAGHASGSPDFGTADPSDCEREEIHLAGSIQPHGTLLVVSEPDHRIIQASANAAEFLNLGSVLGVPLAEIDGDLLIKILPHLDPTAEGMPVAVRCRIGNPSTEYDGLMHRPPEGGLIIELERAGPPIDLSGTLAPALERIRTAGSLRALCDDTALLFQQCTGYDRVMVYRFDEQGHGEVYSEIHVTGLESYFGNRYPSSLVPQMARRLYERQRVRVLVDVSYQPVPLEPRLSPLTGRDLDMSGCFLRSMSPTHLQFLKNMGVRATLVVSLVVGGKLWGLVICHHYLPRFIHFELRAICELLAEAIATRITAL,mirfp,8.96,703,674,92400,,,default,4.3,0.097,mirfp_default,b,,HO9GG
m,10.1038/ncomms12405,AOD74926,,miRFP670,,,MVAGHASGSPAFGTASHSNCEHEEIHLAGSIQPHGALLVVSEHDHRVIQASANAAEFLNLGSVLGVPLAEIDGDLLIKILPHLDPTAEGMPVAVRCRIGNPSTEYCGLMHRPPEGGLIIELERAGPSIDLSGTLAPALERIRTAGSLRALCDDTVLLFQQCTGYDRVMVYRFDEQGHGLVFSECHVPGLESYFGNRYPSSTVPQMARQLYVRQRVRVLVDVTYQPVPLEPRLSPLTGRDLDMSGCFLRSMSPCHLQFLKDMGVRATLAVSLVVGGKLWGLVVCHHYLPRFIRFELRAICKRLAERIATRITALES,mirfp670,12.24,670,642,87400,1.42,180.0,default,4.5,0.14,mirfp670_default,b,,DP999
m,10.1038/s41467-018-08050-8,MK176509,,miRFP670nano,6MGH,,MANLDKMLNTTVTEVRQFLQVDRVCVFQFEEDYSGVVVVEAVDDRWISILKTQVRDRYFMETRGEEYSHGRYQAIADIYTANLTECYRDLLTQFQVRAILAVPILQGKKLWGLLVAHQLAAPRQWQTWEIDFLKQQAVVVGIAIQQS,mirfp670nano,10.26,670,645,95000,,100.0,default,3.7,0.108,mirfp670nano_default,b,,1KNNM
m,10.1038/s41589-018-0044-1,,,miRFP720,,,MAEGSVARQPDLLTCDDEPIHIPGAIQPHGLLLALAADMTIVAGSDNLPELTGLAIGALIGRSAADVFDSETHNRLTIALAEPGAAVGAPITVGFTMRKDAGFIGSWHRHDQLIFLELEPPQRDVAEPQAFFRRTNSAIRRLQAAETLESACAAAAQEVRKITGFDRVMIYRFASDFSGEVIAEDRCAEVESKLGLHYPASFIPAQARRLYTINPVRIIPDINYRPVPVTPDLNPVTGRPIDLSFAILRSVSPVHLEFMRNIGMHGTMSISILRGERLWGLIVCHHRTPYYVDLDGRQACKRVAERLATQIGVMEE,mirfp720,5.98,720,702,98000,,,default,4.5,0.061,mirfp720_default,b,,AJLWS
m,10.1073/pnas.1807449115,MK040732,,mKelly2,,,MELIKENMRMKLYMEGTVGNHHFKCTAEGEGKPYEGTQTQRIKVVEGGPLPFAFDILATCFMYGSKTFINYPQGIPDFFKQSFPEGFTWERVTTYEDGGVLTVTQDTSLQDGYLIYNVKLRGVNFPSNGPVMQKKTLGWEPTTEYLVPVDGGLEGTCDMALRLVGGGHLKCNLKTTYRSKKPAKNLKMPGEHQVDRKLERIKEADNETYVEQHEVAVAR,mkelly2,7.74,649,598,43000,,20.0,default,5.6,0.18,mkelly2_default,b,,T9G4X
m,10.1038/nmeth.1235,,,mKO&kappa;,,,MVSVIKPEMKMRYYMDGSVNGHEFTIEGEGTGRPYEGHQEMTLRVTMAEGGPMPFAFDLVSHVFCYGHRVFTKYPEEIPDYFKQAFPEGLSWERSLEFEDGGSASVSAHISLRGNTFYHKSKFTGVNFPADGPIMQNQSVDWEPSTEKITASDGVLKGDVTMYLKLEGGGNHKCQFKTTYKAAKEILEMPGDHYIGHRLVRKTEGNITEQVEDAVAHS,mkokappa,64.05,563,551,105000,,,default,4.2,0.61,mkokappa_default,b,,HMK8R
m,10.1038/nmeth.2413,AGG56535,34051755,mNeonGreen,5LTP,5LTR,MVSKGEEDNMASLPATHELHIFGSINGVDFDMVGQGTGNPNDGYEELNLKSTKGDLQFSPWILVPHIGYGFHQYLPYPDGMSPFQAAMVDGSGYQVHRTMQFEDGASLTVNYRYTYEGSHIKGEAQVKGTGFPADGPVMTNSLTAADWCRSKKTYPNDKTIISTFKWSYTTGNGKRYRSTARTTYTFAKPMAANYLKNQPMYVFRKTELKHSKTELNFKEWQKAFTDVMGMDELYK,mneongreen,92.8,517,506,116000,3.1,10.0,default,5.7,0.8,mneongreen_default,b,,ZRKRV
m,10.1038/nmeth.2888,AHL19968,49083568,mNeptune2,,,MVSKGEELIKENMHMKLYMEGTVNNHHFKCTSEGEGKPYEGTQTGRIKVVEGGPLPFAFDILATCFMYGSKTFINHTQGIPDFFKQSFPEGFTWERVTTYEDGGVLTVTQDTSLQDGCLIYNVKLRGVNFPSNGPVMQKKTLGWEASTETLYPADGGLEGRCDMALKLVGGGHLHCNLKTTYRSKKPAKNLKMPGVYFVDRRLERIKEADNETYVEQHEVAVARYCDLPSKLGHKLNGMDELYK,mneptune2,21.36,651,599,89000,,27.0,default,6.3,0.24,mneptune2_default,b,,VXEVZ
m,10.1038/nmeth.4074,APD76536,129830965,mScarlet-I,,,MVSKGEAVIKEFMRFKVHMEGSMNGHEFEIEGEGEGRPYEGTQTAKLKVTKGGPLPFSWDILSPQFMYGSRAFIKHPADIPDYYKQSFPEGFKWERVMNFEDGGAVTVTQDTSLEDGTLIYKVKLRGTNFPPDGPVMQKKTMGWEASTERLYPEDGVLKGDIKMALRLKDGGRYLADFKTTYKAKKPVQMPGAYNVDRKLDITSHNEDYTVVEQYERSEGRHSTGGMDELYK,mscarlet-i,56.16,593,569,104000,3.1,36.0,default,5.4,0.54,mscarlet-i_default,b,,6VVTK
m,10.1371/journal.pone.0028674,,,mTagBFP2,,,MVSKGEELIKENMHMKLYMEGTVDNHHFKCTSEGEGKPYEGTQTMRIKVVEGGPLPFAFDILATSFLYGSKTFINHTQGIPDFFKQSFPEGFTWERVTTYEDGGVLTATQDTSLQDGCLIYNVKIRGVNFTSNGPVMQKKTLGWEAFTETLYPADGGLEGRNDMALKLVGGSHLIANAKTTYRSKKPAKNLKMPGVYYVDYRLERIKEANNETYVEQHEVAVARYCDLPSKLGHKLN,mtagbfp2,32.38,454,399,50600,2.6,12.0,default,2.7,0.64,mtagbfp2_default,b,,ZO7NN
m,10.1042/bj20060874,ABG77397,5860107,mTFP1,2HQK,,MVSKGEETTMGVIKPDMKIKLKMEGNVNGHAFVIEGEGEGKPYDGTNTINLEVKEGAPLPFSYDILTTAFAYGNRAFTKYPDDIPNYFKQSFPEGYSWERTMTFEDKGIVKVKSDISMEEDSFIYEIHLKGENFPPNGPVMQKKTTGWDASTERMYVRDGVLKGDVKHKLLLEGGGHHRVDFKTIYRAKKAVKLPDYHFVDHRIEILNHDKDYNKVTVYESAVARNSTDGMDELYK,mtfp1,54.4,492,462,64000,3.2,,default,4.3,0.85,mtfp1_default,b,,ASSY9
m,10.1038/ncomms1738,,,mTurquoise2,3ZTF,,MVSKGEELFTGVVPILVELDGDVNGHKFSVSGEGEGDATYGKLTLKFICTTGKLPVPWPTLVTTLSWGVQCFARYPDHMKQHDFFKSAMPEGYVQERTIFFKDDGNYKTRAEVKFEGDTLVNRIELKGIDFKEDGNILGHKLEYNYFSDNVYITADKQKNGIKANFKIRHNIEDGGVQLADHYQQNTPIGDGPVLLPDNHYLSTQSKLSKDPNEKRDHMVLLEFVTAAGITLGMDELYK,mturquoise2,27.9,474,434,30000,4.0,33.5,default,3.1,0.93,mturquoise2_default,b,,7AV5G
m,10.1021/bi0516273,AAZ65844,4596892,mVenus,,,MVSKGEELFTGVVPILVELDGDVNGHKFSVSGEGEGDATYGKLTLKLICTTGKLPVPWPTLVTTLGYGLQCFARYPDHMKQHDFFKSAMPEGYVQERTIFFKDDGNYKTRAEVKFEGDTLVNRIELKGIDFKEDGNILGHKLEYNYNSHNVYITADKQKNGIKANFKIRHNIEDGGVQLADHYQQNTPIGDGPVLLPDNHYLSYQSKLSKDPNEKRDHMVLLEFVTAAGITLGMDELYK,mvenus,66.56,527,515,104000,2.7,17.6,default,5.5,0.64,mvenus_default,b,,WCSN6
m,10.1186/1754-1611-4-10,,,mVenus-Q69M,,,MVSKGEELFTGVVPILVELDGDVNGHKFSVSGEGEGDATYGKLTLKLICTTGKLPVPWPTLVTTLGYGLMCFARYPDHMKQHDFFKSAMPEGYVQERTIFFKDDGNYKTRAEVKFEGDTLVNRIELKGIDFKEDGNILGHKLEYNYNSHNVYITADKQKNGIKANFKIRHNIEDGGVQLADHYQQNTPIGDGPVLLPDNHYLSYQSKLSKDPNEKRDHMVLLEFVTAAGITLGMDELYK,mvenus-q69m,96.97,528,515,,,9.6,default,,,mvenus-me_default,b,,FE6UX
