agg,doi,genbank,ipg_id,name,seq,slug,states.0.brightness,states.0.em_max,states.0.ex_max,states.0.ext_coeff,states.0.lifetime,states.0.maturation,states.0.name,states.0.pka,states.0.qy,states.0.slug,states.1.brightness,states.1.em_max,states.1.ex_max,states.1.ext_coeff,states.1.lifetime,states.1.maturation,states.1.name,states.1.pka,states.1.qy,states.1.slug,states.2.brightness,states.2.em_max,states.2.ex_max,states.2.ext_coeff,states.2.lifetime,states.2.maturation,states.2.name,states.2.pka,states.2.qy,states.2.slug,states.3.brightness,states.3.em_max,states.3.ex_max,states.3.ext_coeff,states.3.lifetime,states.3.maturation,states.3.name,states.3.pka,states.3.qy,states.3.slug,switch_type,transitions.0.from_state,transitions.0.to_state,transitions.0.trans_wave,transitions.1.from_state,transitions.1.to_state,transitions.1.trans_wave,transitions.2.from_state,transitions.2.to_state,transitions.2.trans_wave,transitions.3.from_state,transitions.3.to_state,transitions.3.trans_wave,transitions.4.from_state,transitions.4.to_state,transitions.4.trans_wave,uniprot,uuid
t,10.1007/s10126-007-9072-7,AAZ14789,4535492,ccalOFP1,MSLSKQVLPRDVKMRFHMDGCVNGHSFTIEGEGTGKPYEGKKTLKLRVTKGGPLPFAFDILSATFTYGNRCFCDYPEEMPDYFKQSLPEGYSWERTMMYEDGACSTASAHISLDKDCFIHNSTFHGVNFPANGPVMQKKAMNWEPSSELITPCDGILKGDVTMFLLQEGGHRHKCQFTTSYKAHKAVKIPPNHIIEHRLVRKEVGDAVQIQEHAVAKHFTVQIKEA,ccalofp1,44.2,561,508,85000,,,default,,0.52,ccalofp1_default,,,,,,,,,,,,,,,,,,,,,,,,,,,,,,,b,,,,,,,,,,,,,,,,Q1ALD3,5YBHO
m,10.1016/j.chembiol.2011.08.007,,,Dendra2-M159A,MNTPGINLIKEDMRVKVHMEGNVNGHAFVIEGEGKGKPYEGTQTANLTVKEGAPLPFSYDILTTAVHYGNRVFTKYPEDIPDYFKQSFPEGYSWERTMTFEDKGICTIRSDISLEGDCFFQNVRFKGTNFPPNGPVMQKKTLKWEPSTEKLHVRDGLLVGNINAALLLEGGGHYLCDFKTTYKAKKVVQLPDAHFVDHRIEILGNDSDYNKVKLYEHAVARYSPLPSQVW,dendra2-m159a,,,,,,,Green (off),,,dendra2-m159a_green-off,,,,,,,Orange (off),,,dendra2-m159a_orange-off,28.11,504,471,51100,2.8,,Green,6.5,0.55,dendra2-m159a_green,33.75,562,528,45000,4.0,,Orange,6.8,0.75,dendra2-m159a_orange,mp,dendra2-m159a_orange-off,dendra2-m159a_orange,440,dendra2-m159a_orange,dendra2-m159a_orange-off,561,dendra2-m159a_green-off,dendra2-m159a_green,405,dendra2-m159a_green,dendra2-m159a_green-off,488,dendra2-m159a_green,dendra2-m159a_orange,405,,CQ4QL
t,10.1186/1472-6750-9-32,FJ498891,,E2-Orange,MDSTENVIKPFMRFKVHMEGSVNGHEFEIEGEGEGKPYEGTQTAKLQVTKGGPLPFAWDILSPQFTYGSKAYVKHPADIPDYKKLSFPEGFKWERVMNFEDGGVVTVTQDSSLQDGTFIYHVKFIGVNFPSDGPVMQKKTLGWEPSTERLYPRDGVLKGEIHKALKLKGGGHYLVEFKTIYMAKKPVKLPGYYYVDSKLDITSHNEDYTVVEQYERAEARHHLFQ,e2-orange,19.71,561,540,36500,,78.0,default,4.5,0.54,e2-orange_default,,,,,,,,,,,,,,,,,,,,,,,,,,,,,,,b,,,,,,,,,,,,,,,,,A3B6M
m,10.1038/nbt1037,AAV52167,3838242,mBanana,MVSKGEENNMAVIKEFMRFKVRMEGSVNGHEFEIEGEGEGRPYEGTQTAKLKVTKGGPLPFAWDILSPQFCYGSKAYVKHPTGIPDYFKLSFPEGFKWERVMNFEDGGVVTVAQDSSLQDGEFIYKVKLRGTNFPSDGPVMQKKTMGWEASSERMYPEDGALKGEIKMRLKLKDGGHYSAETKTTYKAKKPVQLPGAYIAGEKIDITSHNEDYTIVELYERAEGRHSTGGMDELYK,mbanana,4.2,553,540,6000,,60.0,default,6.7,0.7,mbanana_default,,,,,,,,,,,,,,,,,,,,,,,,,,,,,,,b,,,,,,,,,,,,,,,,,9GUD2
m,10.1038/nbt1037,AAV52171,3838140,mHoneydew,MASSEDVIKEFMRFKVRMEGSVNGHEFEIEGEGEGRPYEGTQTAKLKVTKGGPLPFAWDILSPQFMWGSKAYVKHPADIPDYLKLSFPEGFKWERVMNFEDGGVVTVTQDSSLQDGEFIYKVKLRGTNFPSDGPVMQKKTMGWAATTERMYPEDGALKGEIKMRLKLKDGGHYDAEVKTTYMAKKPVQLPGAYKIDGKLDITSHNEDYTIVEQYERAEGRHSTGA,mhoneydew,2.04,562,487,17000,,,default,4.0,0.12,mhoneydew_default,,,,,,,,,,,,,,,,,,,,,,,,,,,,,,,b,,,,,,,,,,,,,,,,,FLO5T
m,10.1016/j.chembiol.2013.08.008,AGX93076,44320375,mPapaya,MVSKGEGQSKHGLKEEMTVKYHMEGCVNGHKFVITGEGIGNPFKGKQTANLCVIEGGPLPFSEDILSPGFKYGDRIFTEYPQDIVDYFKNSCPAGYTWERSYLFEDGAVCRCNVDITVSEKENCIYHKSIFRGVNFPADGPVMKKMTTNWEASTEKIVPVPKQGILKGKVKMCLLLKDGGRYHCQFDTVYKAKSVPSKMPEWHFIQHKLLREDRSDAKNQKWQLTEHAIAGMDELYK,mpapaya,35.69,541,530,43000,,,default,6.8,0.83,mpapaya_default,,,,,,,,,,,,,,,,,,,,,,,,,,,,,,,b,,,,,,,,,,,,,,,,,5LCAQ
m,10.1016/j.chembiol.2013.08.008,,,mPapaya0.7,MVSKGEGQSKHGLKEEMTVKYHMEGCVNGHKFVITGEGIGNPFKGKQTANLCVIEGGPLPFSEDILSPGFKYGDRIFTEYPQDIVDYFKNSCPAGYTWERSYLFEDGAVCRCNVDITVSEKENCIYHKSIFRGVNFPADGPVMKKMTTNWEASTEKIVPVPKQGILKGKVKMYLLLKDGGRYHCQFDTVYKAKSVPSKMPEWHFIQHKLLREDRSDAKNQKWQLTEHAIAGMDELYK,mpapaya07,15.87,541,529,23000,,,default,6.8,0.69,mpapaya07_default,,,,,,,,,,,,,,,,,,,,,,,,,,,,,,,b,,,,,,,,,,,,,,,,,LGDN9
m,10.1016/j.chembiol.2011.08.007,,,NijiFP,MNTPGINLIKEDMRVKVHMEGNVNGHAFVIEGEGKGKPYEGTQTANLTVKEGAPLPFSYDILTTAVHYGNRVFTKYPEDIPDYFKQSFPEGYSWERTMTFEDKGICTIRSDISLEGDCFFQNVRFKGTNFPPNGPVMQKKTLKWEPSTEKLHVRDGLLVGNINMALLLEGGGHYLCDSKTTYKAKKVVQLPDAHFVDHRIEILGNDSDYNKVKLYEHAVARYSPLPSQVW,nijifp,,,,,,,Green (off),,,nijifp_green-off,,,,,,,Orange (off),,,nijifp_orange-off,26.3,507,469,41100,3.4,,Green,7.0,0.64,nijifp_green,27.3,569,526,42000,4.2,,Orange,7.3,0.65,nijifp_orange,mp,nijifp_orange-off,nijifp_orange,440,nijifp_orange,nijifp_orange-off,561,nijifp_green-off,nijifp_green,405,nijifp_green,nijifp_green-off,488,nijifp_green,nijifp_orange,405,,87UEF
