agg,doi,genbank,ipg_id,name,pdb.0,seq,slug,states.0.brightness,states.0.em_max,states.0.ex_max,states.0.ext_coeff,states.0.lifetime,states.0.maturation,states.0.name,states.0.pka,states.0.qy,states.0.slug,states.1.brightness,states.1.em_max,states.1.ex_max,states.1.ext_coeff,states.1.lifetime,states.1.maturation,states.1.name,states.1.pka,states.1.qy,states.1.slug,switch_type,transitions.0.from_state,transitions.0.to_state,transitions.0.trans_wave,transitions.1.from_state,transitions.1.to_state,transitions.1.trans_wave,uniprot,uuid
d,10.1101/677344,,,AausFP1,,MSYGALLFREKIPYVVEMEGDVEGMKFSVRGKGHGDANTGKIEASFICTTGELPVPWSSILTTVTYGAQCFAKYPNDIKDYPKSAMPEGYVQERTITFENDGVYKTRAEVTYEKGSVYNRVTLNGSGFKKGGNILGKKLEFNYNPHCIYVLPDVQNNGIKCYINIVHDVIGGGQIIAAHQQLNTPLGGGPVDIPHYHHIQAHTILSKDPKETRDHMNVVEVFRAIDCKTAYA,aausfp1,164.9,510,504,170000,,,default,4.4,0.97,aausfp1_default,,,,,,,,,,,b,,,,,,,,C2FJQ
,10.1101/677344,,,AausFP2,,MACGALLFKGKIPFVVELEGDVNGEVFSVRGNGWGDGSTGKLEIKFVCTTGEVPLAWESLICSMAYGALVFCKYPSNINDFFKSTMPRGYIQERKISYENDGTFDVRQEVTYENGALYNRVKFNGSGFRKDGNVLGKKLDLTSIGTCIYIMGNDEGTGLKGVFNKAFKVIGGNRQIASHVQTQTPIGDGLVSIPDYHVMHNHIACSKDPSETRDHIIVKESLRAVDCNTEYM,aausfp2,,,609,52000,,,default,6.0,,aausfp2_default,,,,,,,,,,,b,,,,,,,,UHNQV
,10.1101/677344,,,AausFP3,,MACGALLFKGKIPFVVELEGDVNGEVFSVRGNGWGDGSTGKIEIKFVCTTGEIPVAWESLVCSLAYGALVFAKYPSNINDFFKSTMPKGYIQERNIQFENDGQYVTRAEVTYENGTLYNRVKLNGSGFRKDGNILGKKLDSTSLGTCIYIMGNDQGNGLKGVYNKAYKVIGGNRQLASHQQTHTPIGDGLVSIPDYHVMHNHIACSKDPSETRDHIIVKESLRAVDCNTEYM,aausfp3,,,587,59000,,,default,6.5,,aausfp3_default,,,,,,,,,,,b,,,,,,,,OEVJT
d,10.1101/677344,,,AausFP4,,MNCGALLFQQKVPFIVEMEGDVNGEIFSVRGNGFGNATTGKLDILFVCTTGEIPVAWESLISSLAYGAFVFAKYPSNIADFFKSTMPEGYIQERKVTFENDGTYETHATVTYENGAIFERVKLTGTGFREDGNILGKKLEITSLGTPLSIMADDEGKGLRSVFNQAIKVVGGNRQIAIHEQRNRPIGDGLISVPDYHTLHNHLKCSKVSTEKRDHMMVNETLKAIDCQTAYL,aausfp4,,513,477,69000,,,On,,,aausfp4_on,,,,,,,Off,,0.001,aausfp4_off,ps,aausfp4_off,aausfp4_on,340,aausfp4_on,aausfp4_off,480,,F5F6H
d,10.1101/677344,,,AausGFP,,MKIYCEGEKLFKGIVPIQIELNGDVNGHKFSVHGEGQGEAEMGRLTLRFVCTTGKMPVPWPTLVTTFSYGVQCFSRYPEHMKMHDFFKSAMPEGYTQERTIFFDKDGTYKTRAEVKFEGDTLVNRIELTGTGFKEDGNILGHKMEYNYNSHNVYIMSDKAKNGIKVNFKIRHNIEDGTVQLADHYQANYPLGKGPVLLPEDHYLSTQSALTKDPHETRDHMLLLEFVTAAGITHGMDELYK,aausgfp,21.17,503,398,29000,,,default,4.8,0.73,aausgfp_default,,,,,,,,,,,b,,,,,,,,D7QYG
,10.1038/s41586-019-1882-z,LC381432,,Achilles,,MVSKGEELFTGVVPILVELDGDVNGHKFSVRGEGEGDATIGKLTLKLICTTGKLPVPWPTLVTTLGYGLAVFARYPDHMKQHDFFKSAMPEGYVQERTIFFKDDGNYKTRAEVKFEGDTLVNRIELKGSGFKEDGNILGHKLEYNFNSHNVYITADKQKNGIKANFKIRHNIEDGGVQLADHYQQNTPIGDGPVLLPDNHYLSYQSFLSKDPNEKRDHMVLLEFVTAAGITLGMDELYK,achilles,70.4,525,513,110000,,,default,5.5,0.64,achilles_default,,,,,,,,,,,b,,,,,,,,MLHQR
wd,10.1101/677344,,,AvicFP1,,MSKGAELFNGIVPILIELNGDVHGHKFSVRGEGEGDAGSGKIEIKFVCTTGTLPVPWPTLVTTFCYGVQCFTRYPEHMKQHDFYKSAMPDGYIQKRTISFQDDGHYKTRAEVKFEGDTLVNRIELKGIDFKEDGNILGNKMEYNYNSHSVYVLSDKANNGIKVNFKIRHNLKGEGIQLADHDQQNIPIGDGPVLLPDYHYLSTQTAITKDPNEKRDHMNLVEFVTACGITHGMDELYK,avicfp1,40.32,503,481,64000,,,default,4.9,0.63,avicfp1_default,,,,,,,,,,,b,,,,,,,,VE1RL
,10.1101/677344,,,AvicFP2,,MNCGALLFKQKIPFIVELDGDVNGQVFSVRGNGFGDGSIGKIEIKFVCTTGEIPVAWESLVCSLAYGALVFTKYPSNINDFFKSTMPKGYIQERKITFENDGQYETRAEVTYENGALYNRVKLNGSGFRKDGNILGKKLDATSLGTCIYILSNDEGNGLKGVYNMAYKVIDGNRQIVSHQQTNTPIGDGLVSIPDYHVMHNHISCSKDPTEPRDHLILKESVTAVDCQTAYM,avicfp2,2.36,515,480,59000,,,pre-conversion,,0.04,avicfp2_pre-conversion,,,,41000,,,post-conversion,,0.0,avicfp2_post-conversion,b,avicfp2_pre-conversion,avicfp2_post-conversion,480,,,,,FHG23
,10.1101/677344,,,AvicFP3,,MNCGALLFKQKIPFIVELDGDVNGQVFSVRGNGFGDGSTGKIEIKFVCTTGEIPVAWESLVCSLAYGALVFTKYPSNINDFFKSTMPKGYIQERKITFENDGQYETRAEVTYENGALYNRVKLNGSGFRKDGNILGKKLDATSLGTCIYIMSNDQGNGLKGVYNKAYKVIGGNRQLASHQQTHTPIGDGLVSIPDYHVMHNHTSCSKDPTEPRDHLILKESVTAVDCQTAYM,avicfp3,,520,480,,,,pre-conversion,,0.001,avicfp3_pre-conversion,,,,,,,post-conversion,,,avicfp3_post-conversion,b,,,,,,,,ZJWZK
,10.1101/677344,,,AvicFP4,,MDSGALLFKQKIPLVVEFEGDVEGMKFSVRGKGHGDATNGRIEASFICTTGELPVPWSSIISSLTYGFLCFTKYPDGIKDFPKSAMPEGYVQERTISFENDGTYKTRAEVTFENGSVYNRVKLNGEGFNKGGNILGKKLEYSFNPHCIYVLGDKENNGIRCCFNVVHNIVGGGQLIASHSQLNTPLGGGPIAIPEYHHICNHTTLSKDPREPRDHMTVAEVLKAVDCKTAYL,avicfp4,12.1,512,500,121000,,,default,,0.1,avicfp4_default,,,,,,,,,,,b,,,,,,,,LTRTO
m,10.1101/2020.03.30.015156,LC085679,,AzaleaB5,,MENVRRKTGIQTEMKTKLHMDGMVNGHSFEIKGEGKGSPYEGVQTMKLKVTKGAPLPFSIDILLPQCMYGSKPFIKYPENIPDYLKLSFPEGITWERTMTFEDGAVCDVSNDSRLVGNCFIYTVKFQGVNFPLDGPVMQKKTRGWEPSTEVLYECDGWMRGLVDIALKLENGGHYMCNFKTTYKSKKGLEVPPYHFVDHKLDLLSHNTDGATFEEFEQGEIAHAHLSKLA,azaleab5,60.32,596,574,104000,,,default,,0.58,azaleab5_default,,,,,,,,,,,b,,,,,,,,886AH
d,10.1002/cbic.201800695,,,BDFP2.0,,MVSKGEEDNMAIIKEFMRFKVHMEGSVNGHEFEIEGEGEGRPYEGTQTAKLKVTKGGPLPFAWDILSPQFMYGSKAYVKHPADIPDYLKLSFPEGFKWERVMNFEDGGVVTVTQDSSLQDGEFIYKVKLRGTNFPSDGPVMQKKTMGWEASSERMYPEDGALKGEIKQRLKLKDGGHYDAEVKTTYKAKKPVQLPGAYNVNIKLDITSHNEDYTIVEQYERAEGRHSTGGMDELYKGHGTGSGSTGSGGMANREVVETLKELLADGEKRVQVAGVIGTNAAEVVKTAVSLLFQEYPELVSPGGCAYTTRRYNMCVRDMNYFLRMCSYAIVAGGASVLDGRMLAGFRDTFNSLGIPLCPAARGIQLMKKIVKEKLATAGMTNIAFVDEPFDYIARVISETEI,bdfp20,,666,587,,,,Fret,,,bdfp20_fret,,,,,,,,,,,b,,,,,,,,P9XBV
,10.1021/acs.jafc.9b05473,,,BR1,,MIEKNYVITDPRLPDNPIIFASDGFLELTGYSREEILGRNARFLQGPETDQATVQKIRDAIRDQRETTVQLINYTKSGRKFWNLLHLQPVRDQKGELQYFIGVQLDGSDRV,br1,5.62,495,450,12500,,,BR1,,0.45,br1_br1,,,,,,,,,,,b,,,,,,,,WH633
,10.1002/mrd.23157,,,EaGFP,,MSVVKPDMKIKLRMRGTVNGHNFVIEGEGNGKPYEGTQTIDLKVIEGAPLPFAYDILTPAFQYGNRAFTNYPADIPDYFKQTFPEGYSWERIMIYEDQGMCMATSHISLEGNCFFYDIRFHGVNFPPNGPVMQKKIQKSEPSTEKMYERDGMLKGDVNMALLLKGGGHYRCDFRSSYKAKKRVILPDYHYVDHRIEILSHEKDYSKVALHAIAKARYSLMPIAKTE,eagfp,,514,506,,,,default,,,eagfp_default,,,,,,,,,,,b,,,,,,,,QJSF2
m,10.1038/s41467-019-13897-6,MN701051,,emiRFP670,,MAEGSVARQPDLLTCEHEEIHLAGSIQPHGALLVVSEHDHRVIQASANAAEFLNLGSVLGVPLAEIDGDLLIKILPHLDPTAEGMPVAVRCRIGNPSTEYCGLMHRPPEGGLIIELERAGPSIDLSGTLAPALERIRTAGSLRALCDDTVLLFQQCTGYDRVMVYRFDEQGHGLVFSECHVPGLESYFGNRYPSSTVPQMARQLYVRQRVRVLVDVTYQPVPLEPRLSPLTGRDLDMSGCFLRSMSPCHLQFLKDMGVRATLAVSLVVGGKLWGLVVCHHYLPRFIRFELRAICKRLAERIATRITALES,emirfp670,12.24,670,642,87400,1.53,,default,4.5,0.14,emirfp670_default,,,,,,,,,,,b,,,,,,,,YHJV5
m,10.1038/s41467-019-13897-6,MN701053,,emiRFP703,,MAEGSVARQPDLLTCEHEEIHLAGSIQPHGALLVVSEHDHRVIQASANAAEFLNLGSVLGVPLAEIDGDLLIKILPHLDPTAEGMPVAVRCRIGNPSTEYCGLMHRPPEGGLIIELERAGPSIDLSGTLAPALERIRTAGSLRALCDDTVLLFQQCTGYDRVMVYRFDEQGHGLVFSECHVPGLESYFGNRYPSSLVPQMARQLYVRQRVRVLVDVTYQPVPLEPRLSPLTGRDLDMSGCFLRSMSPIHLQFLKDMGVRATLAVSLVVGGKLWGLVVCHHYLPRFIRFELRAICKRLAERIATRITALES,emirfp703,7.82,703,674,90900,,,default,4.5,0.086,emirfp703_default,,,,,,,,,,,b,,,,,,,,GNJK5
m,10.1021/acs.biochem.0c00484,,,FusionRed-MQV,,MVSELIKENMPMKLYMEGTVNNHHFKCTSEGEGKPYEGTQTQRIKVVEGGPLPFAFDILATSFMYGSRTFIKHPPGIPDFFKQSFPEGFTWERVTTYEDGGVLTATQDTSLQDGCLIYNVKVRGVNFPANGPVMQKKTLGWEASTETMYPADGGLEGAVDMALKLVGGGHLICNMETTYRSKKPATNLKMPGVYNVDHRLERIKEADDETYVEQHEVAVARYSTGGAGDGGK,fusionred-mqv,76.32,585,566,144000,2.77,195.0,default,4.6,0.53,fusionred-mqv_default,,,,,,,,,,,b,,,,,,,,F35B7
m,10.1038/s41467-019-12761-x,,,GZnP3,,,gznp3,0.45,512,488,4000,,,GZnP3 (apo state),,0.112,gznp3_gznp3-apo-state,10.81,512,488,23400,,,GZnP3 (Zn²⁺-bound),,0.462,gznp3_gznp3-zn2-bound,b,,,,,,,,1E8G7
d,10.1101/2020.03.30.015156,BBC08820,,h2-3,,MSKLQKGVEKEMKIKLTMNCTVNERNFVITGQGAGEPYDGTQTLYLTVEGGKTLNFSFDVLTPAFQYGNRAFTKYPGNIPDFFKQTFSGGGYTWKRTMTYEDGGVSTVESDISVQGDCFHYKIQFNGKFPPHGPVMQKETVKWEPSTEVMYKDDKNDGVLKGDVNMALLLKDGGHLRVDFNTSYIPKNKVEKMPDYHFVDHRIEILEKPEGRPVKLYAGAVARYSLLPEKNLNK,h2-3,115.7,516,506,130000,,,default,4.6,0.89,h2-3_default,,,,,,,,,,,b,,,,,,,,YQ25V
,10.1021/acs.jafc.0c00121,,,KOFP-7,,MSPMINAKLLQLMVEYSNDGIVVAEPEGNESILIYVNPAFERLTGYCADDILYQDGRFLQGEDHDQPGIAIIREAIREGRPCCQVLRNYRKDGSLFWNELSITPVHNEADRLTYFIGTQRDVTAQVFAEERMRELEAEVAELRRQ,kofp-7,,496,450,,,,KOFP-7,,0.61,sang-taek-jung_kofp-7,,,,,,,,,,,b,,,,,,,,25HRD
,10.1093/jmicro/dfab001,,,Kohinoor2.0,,MSVIKPDMKIKLRMEGAVNGHPFAIEGVGLGKPFEGKQSVDLKVKEGGPLPFAYDILTMAFCYGNRVFAKYPENIVDYFKQSFPEGYSWERSMIYEDGGICIATNDITLDGDCYIYEIRFDGVNFPANGPVMQKRTVKWEPSTEKLYVRDGVVKSDGNYALLLEGGGHYLCDSKTTYKAKKVVQMPDNHDVVHHIEIKSHDRDYSNVNLHEHAVAHSGLPRQAK,kohinoor20,,,,,,,Off,,,kohinoor20_off,18.94,516,500,31200,,14.7,On,,0.607,kohinoor20_on,ps,,,,,,,,L1ZEW
m,10.3390/ijms222312887,,,LSSmScarlet,7OIN,MVSKGEAVIKEFMRFKVHMEGSMNGHEFEIEGEGEGRPYEGTQTAKLKVTKGGPLPFSWDILSPQFMYGSRAFIKHPADIPDYHKQSFPEGFKWERVMNFEDGGAVTVTQDTSLEDGTLIYEVKLRGTNFPPDGPVMQKKTMGLEADTERLYPEDGVLKGDIKMALRLKDGGRYLADVRTTYKAKKPVQMPGAYNVDRKLDITSHNEDYTVVEQYERSEGRHSTGGMDELYK,lssmscarlet,12.68,598,470,30200,,61.0,default,5.8,0.42,lssmscarlet_default,,,,,,,,,,,b,,,,,,,,POBTH
m,10.1101/677344,,,mAvicFP1,,MSKGAELFNGIVPILIELNGDVHGHKFSVRGEGEGDAGSGKIEIKFVCTTGTLPVPWPTLVTTLCYGVQCFTRYPEHMKQHDFYKSAMPDGYIQKRTISFQDDGHYKTRAEVKFEGDTLVNRIELKGIDFKEDGNILGNKMEYNYNSHSVYVLSDKANNGIKVNFKIRHNLKGEGIQLADHDQQNIPIGDGPVLLPDYHYLSTQTKITKDPNEKRDHMNLVEFVTACGITHGMDELYK,mavicfp1,40.95,503,480,65000,,,default,4.9,0.63,mavicfp1_default,,,,,,,,,,,b,,,,,,,,SXYKQ
m,10.26434/chemrxiv-2022-v3t03,,,mCherry-XL,,MVSKGEEDNMAIIKEFMRFKVHMEGSVNGHEFEIEGEGEGRPYEGTQTAKLKVTKGGPLPFAWDILSPQFMYGSKAYVKHPADIPDYLKLSFPEGFKWERVMNFEDGGVVTVTQDSSLQDGEFIYKVKLRGTNFPSDGPVMQKKTMGSEASSERMYPEDGALKGEVKYRLKLKDGGHYDAEVKTTYKAKKPVQLPGAYNVNRKLDITSHNEDYTIVEQYERAEGRHSTGGMDELYK,mcherry-xl,50.4,589,558,72000,3.9,,Fluorescent,4.6,0.7,mcherry-xl_fluorescent,,,,,,,,,,,b,,,,,,,,HZMZV
m,10.1016/j.chembiol.2020.02.004,MN844880.1,,mCRISPRed,6XWY,MVSKGEELIKENMRMKVVMEGSVNGHQFKCTGEGEGRPYEGVQTMRIKVIEGGPLPFAFDILATSFMYGSRTFIKYPADIPDFFKQSFPEGFTWERVTRYEDGGVVTVTQDTSLEDGELVYNVKVRGVNFPSNGPVMQKKTKGWEADTEMMYPADGGLRGYLDRALKVDGGGHLHCNFVTTYRSKKTVGDIKMPGVHAVDHRLERIEESDNETYVVQREVAVAKYSNLGGGMDELYK,mcrispred,13.11,592,460,28500,2.1,354.0,default,2.1,0.46,mcrispred_default,,,,,,,,,,,b,,,,,,,,RTMMX
m,10.1038/s41592-019-0613-6,,,mEosEM,,MVSAIKPDMRIKLRMEGNVNGHHFVIDGEGTGKPYEGKQTMDLEVKEGGPLPFAFDILTTAFHYGNRVFVKYPDNIQDYFKQSFPKGYSWERSMTFEDGGICNARNDITMEGDTFYNKVRFYGTNFPANGPVMQKKTLKWEPSTEKMYVRDGVLTGDIEMALLLEGGAHYRCDFRTTYKAKEKGVKLPGAHFVDHAIEILSHDKDYNKVKLYEHAVAHSGLPDNARR,meosem,122.96,511,503,155650,,,Green,6.0,0.79,meosem_green,112.28,579,569,170128,,,Red,6.5,0.66,meosem_red,pc,meosem_green,meosem_red,405,,,,,DKEXK
m,10.1126/sciadv.abb7438,,,mGold,,MVSKGEELFTGVVPILVELDGDVNGHKFSVSGEGEGDATYGKLTLKFICTTGKLPVPWPTLVTSLGYGLQCFARYPDHMKQHDFFKSAMPEGYVQERTIFFKDDGNYKTRAEVKFEGDTLVNRIELKGIDFKEDGNILGHKLEYNYNSHNVYITADKQKNGIKANFKIRHNIEDGGVQLADHYQQNTPIGDGPVLLPDNHYLSYQSKLSKDPNEKRDHMVLLEFVTAAGITLGMDELYK,mgold,68.48,531,515,107000,,,default,5.9,0.64,mgold_default,,,,,,,,,,,b,,,,,,,,UNETX
m,10.1073/pnas.2000942117,,,mGreenLantern,,MVSKGEELFTGVVPILVELDGDVNGHKFSVRGEGEGDATNGKLTLKFICTTGKLPVPWPTLVTTLGYGVACFARYPDHMKQHDFFKSAMPEGYVQERTISFKDDGTYKTRAEVKFEGDTLVNRIVLKGIDFKEDGNILGHKLEYNFNSHKVYITADKQKNGIKANFKTRHNVEDGGVQLADHYQQNTPIGDGPVLLPDNHYLSHQSKLSKDPNEKRDHMVLKERVTAAGITHDMDELYK,mgreenlantern,73.3,514,503,101800,,13.5,default,5.6,0.72,mgreenlantern_default,,,,,,,,,,,b,,,,,,,,G1VL1
m,10.1101/2021.08.02.454744,MZ682639,,miRFP2,,MVAGHASGSPDFGTASPSDCEHEEIHLAGSIQPHGTLLVVSEPDHRIIQASANAAEFLNLGSVLGIPLAEIDGDLLIKILPHLDLTAEGMPVAVRCRIGNPSTEYDGLMHRPPEGGLIIELERAGPSIDLSGTLAPALERIRTAGSLRALCDDTVLLFQQCTGYDRVMVYRFDERGHGEVYSEIHVTGLESYFGNRYPSSLVPQMARRLYVRQRVRVLVDVTYQPVPLEPRLSPLTGRDLDMSGCFLRSMSPTHLQFLKNMGVRATLVVSLVVGGKLWGLVICHHYLPRFIHFELRAICVLLAEAIATRITAL,mirfp2,2.39,706,676,55600,,,default,3.7,0.043,mirfp2_default,,,,,,,,,,,b,,,,,,,,AYRSR
m,10.1038/s41467-019-13897-6,,,miRFP670-2,,MARKVDLTSCDREPIHIPGSIQPCGCLLACDAQAVRITRITENAGAFFGRETPRVGELLADYFGETEAHALRNALAQSSDPKRPALIFGWRDGLTGRTFDISLHRHDGTSIIEFEPAAAEQADNPLRLTRQIIARTKELKSLEEMAARVPRYLQAMLGYHRVMLYRFADDGSGMVIGEAKRSDLESFLGQHFPASLVPQQARLLYLKNAIRVVSDSRGISSRIVPEHDASGAALDLSFAHLRSISPCHLEFLRNMGVSASMSLSIIIDGTLWGLIICHHYEPRAVPMAQRVAAKRFAERLSTHFTAAHHQR,mirfp670-2,14.01,670,643,103000,1.42,,default,4.5,0.136,mirfp670-2_default,,,,,,,,,,,b,,,,,,,,1KUE6
m,10.1038/s41467-018-08050-8,MK176509,,miRFP670nano,6MGH,MANLDKMLNTTVTEVRQFLQVDRVCVFQFEEDYSGVVVVEAVDDRWISILKTQVRDRYFMETRGEEYSHGRYQAIADIYTANLTECYRDLLTQFQVRAILAVPILQGKKLWGLLVAHQLAAPRQWQTWEIDFLKQQAVVVGIAIQQS,mirfp670nano,10.26,670,645,95000,,100.0,default,3.7,0.108,mirfp670nano_default,,,,,,,,,,,b,,,,,,,,1KNNM
m,10.1038/s41467-019-13897-6,MN701052,,miRFP680,,MAEGSVARQPDLLTCDDEPIHIPGAIQPHGLLLALAADMTIVAGSDNLPELTGLAIGALIGRSAADVFDSETHNRLTIALAEPGAAVGAPITVGFTMRKDAGFIGSWHRHDQLIFLELEPPQRDVAEPQAFFRRTNSAIRRLQAAETLESACAAAAQEVRKITGFDRVMIYRFASDFSGEVIAEDRCAEVESKLGLHYPASTVPAQARRLYTINPVRIIPDINYRPVPVTPDLNPVTGRPIDLSFAILRSVSPCHLEFMRNIGMHGTMSISILRGERLWGLIVCHHRTPYYVDLDGRQACKRVAERLATQIGVMEE,mirfp680,13.63,680,661,94000,1.67,,default,4.5,0.145,mirfp680_default,,,,,,,,,,,b,,,,,,,,RAKQZ
m,10.1038/s41467-019-13897-6,,,miRFP682,,MAEGSVARQPDLLTCDDEPIHIPGAIQPHGLLLALAADMTIVAGSDNLPELTGLAIGALIGRSAADVFDSETHNRLTIALAEPGAAVGAPITVGFTMRKDAGFIGSWHRHDQLIFLELEPPQRDVAEPQAFFRRTNSAIRRLQAAETLESACAAAAQEVRKITGFDRVMIYRFASDFSGVVIAEDRCAEVESKLGLHYPASAVPAQARRLYTINPVRIIPDINYRPVPVTPDLNPVTGRPIDLSFAILRSVSPCHLEFMRNIGMHGTMSISILRGERLWGLIVCHHRTPYYVDLDGRQACKRVAERLATQIGVMEE,mirfp682,10.19,682,663,91000,,,default,4.5,0.112,mirfp682_default,,,,,,,,,,,b,,,,,,,,X1DTP
m,10.1038/s41467-019-13897-6,,,miRFP702,,MARKVDLTSCDREPIHIPGSIQPCGCLLACDAQAVRITRITENAGAFFGRETPRVGELLADYFGETEAHALRNALAQSSDPKRPALIFGWRDGLTGRTFDISLHRHDGTSIVEFEPAAAEQADNPLRLTRQIIARTKELKSLEEMAARVPRYLQAMLGYHRVMLYRFADDGSGKVIGEAKRSDLESFLGQHFPASLVPQQARLLYLKNAIRVVSDSRGISSRIVPEHDASGAALDLSFAHLRSISPIHLEFLRNMGVSASMSLSIIIDGTLWGLIICHHYEPRAVPMAQRVAAKRFAERLSTHFTAAHHQR,mirfp702,7.13,702,673,88000,,,default,4.5,0.081,mirfp702_default,,,,,,,,,,,b,,,,,,,,55FPY
m,10.1038/s41467-019-13897-6,MN701054,,miRFP713,,MAEGSVARQPDLLTCDDEPIHIPGAIQPHGLLLALAADMTIVAGSDNLPELTGLAIGALIGRSAADVFDSETHNRLTIALAEPGAAVGAPITVGFTMRKDAGFIGSWHRHDQLIFLELEPPQRDVAEPQAFFRRTNSAIRRLQAAETLESACAAAAQEVRKITGFDRVMIYRFASDFSGEVIAEDRCAEVESKLGLHYPASTVPAQARRLYTINPVRIIPDINYRPVPVTPDLNPVTGRPIDLSFAILRSVSPVHLEFMRNIGMHGTMSISILRGERLWGLIVCHHRTPYYVDLDGRQACKRVAERLATQIGVMEE,mirfp713,6.93,713,690,99000,0.89,,default,3.5,0.07,mirfp713_default,,,,,,,,,,,b,,,,,,,,2EG15
m,10.1038/s41598-019-52123-7,,,mRhubarb713,,MAEGSVARQPDLLTCDDEPIHIPGAIQPHGLLLALAADMTIVAGSDNLPELTGLAIGALIGRSAADVFDSETHNRLTIALAEPGAAVGAPITVGFTMRKDAGFIGSWHRHDQLIFLELEPPQRDVAEPQAFFRHTNSAIRRLQAAETLESACAAAAQEVRKITGFDRVMIYRFASDFSGEVIAEDRCAEVESKLGLHYPASTVPAQARRLYTINPVRIIPDINYRPVPVTPDLNPVTGRPIDLSFAILRSVSPVHLEFMRNIGMHGTMSISILRGERLWGLIVCHHRTPYYVDLDGRQACELVAQVLARAIGVMEE,mrhubarb713,8.66,713,690,113457,,,Pr,,0.0763,mrhubarb713_pr,,,,,,,,,,,b,,,,,,,,OZEBT
m,10.1038/s41598-019-52123-7,,,mRhubarb719,,MAEGSVARQPDLLTCDDEPIHIPGAIQPHGLLLALAADMTIVAGSDNLPELTGLAIGALIGRSAADVFDSETHNRLTIALAEPGAAVGAPITVGFTMRKDAGFIGSWHRHDQLIFLELEPPQRDVAEPQAFFRHTNSAIRRLQAAETLESACAAAAQEVRKITGFDRVMIYRFASDFSGEVIAEDRCAEVESKLGLHSPASYIPAQARRLYTINPVRIIPDINYRPVPVTPDLNPVTGRPIDLSFAILRSVSPVHLEFMRNIGMHGTMSISILRGERLWGLIVCHHRTPYYVDLDGRQACELVAQVLARAIGVMEE,mrhubarb719,5.7,719,700,83768,,,Pr,,0.068,mrhubarb719_pr,,,,,,,,,,,b,,,,,,,,TUP2T
m,10.1038/s41598-019-52123-7,,,mRhubarb720,,MAEGSVARQPDLLTCDDEPIHIPGAIQPHGLLLALAADMTIVAGSDNLPELTGLAIGALIGRSAADVFDSETHNRLTIALAEPGAAVGAPITVGFTMRKDAGFIGSWHRHDQLIFLELEPPQRDVAEPQAFFRHTNSAIRRLQAAETLESACAAAAQEVRKITGFDRVMIYRFASDFSGEVIAEDRCAEVESKLGQHYPASDIPAQARRLYTINPVRIIPDINYRPVPVTPDLNPVTGRPIDLSFAILRSVSPVHLEFMRNIGMHGTMSISILRGERLWGLIVCHHRTPYYVDLDGRQACELVAQVLARAIGVMEE,mrhubarb720,6.13,720,701,94941,,,Pr,,0.0646,mrhubarb720_pr,,,,,,,,,,,b,,,,,,,,PV8DK
m,10.3390/ijms23063208,,,mRubyFT,,MVSKGEELIKENMRMKVVMEGSVNGHQFKCTGEGEGNPYMGTQTMRIKVIEGGPLPFAFDILATSFLYGSRTFIKYPKGIPDFFKQSFPEGFTWERVTRYEDGGVVTVMQDTSLEDGCLVYHVQVRGVDFPSNGPVMQKKTKGWEPSTEMMYPADGGLRGYTHMALKVDGGGHLSCSFVTTYRSKKTVGNIKMPGIHAVDHRLERLEESDNEMFVVLREHSVAKFAGRGGMDELYK,mrubyft,16.38,457,408,26000,,342.0,Blue-form,3.9,0.63,mrubyft_blue-form,2.55,624,582,29600,,900.0,Red-form,4.5,0.086,mrubyft_red-form,t,,,,,,,,9JNRR
m,10.1021/acscatal.9b02896,,,mTFP*,4Q9W,MSGVIKPDMKIKLKMEGNVNGYAFVIEGEGEGKPYDGTNTINLEVKEGAPLPFSYDILTTAFAYGNRAFTKYPDDIPNYFKQSFPEGYSWERTMTFEDKGIVKVKSDISLEEDSFIYEIYLKGENFPPNGPVMQKKTTGWDASTERMYVRDGVLKGDVKHKLLLEGGGYYRVDFKTIYRAKKAVKLPDYHFVDHRIEILNYDKDYNKVTVYESAVARNSTD,mtfp,,495,468,,,,default,,,mtfp_default,,,,,,,,,,,b,,,,,,,,3OSEV
m,10.7554/elife.67858,,,mVermilion,,MVSKGEELIKEFMRFKVHMEGSVNGHEFEIEGEGEGRPYEGTQTAKLKVTKGGPLPFAWDILSPQFMYGSKAYVKHPADIPDFFKQSFPEGFKWERVMNFEDGGVVTVTQDSSLQDGEFIYKVKLRGTNFPSDGPVMQKKTMGWEASSERMYPEDGALKGEIKQRLKLKDGGHYDAEVKTTYKAKKPVGNIKMPGAYNVNIKLDITSHNEDYTIVEQYERAEGRASTGG,mvermilion,,,,,,,,,,,,,,,,,,,,,b,,,,,,,,PYHHJ
m,10.1021/acsnano.0c08207,MZ404620.1,,Padron2,,MAVIKPDMKIKLRMEGAVNGHPFAIEGVGLGKPFEGKQSVDLKVKEGGPLPFAYDILSMAFCYGNKVFIKYPENIVDYFKQLFPEGYSWERSMIYEDGGICNATNDITLDGDCFIYEIRFDGVNFPANGPVMQKRTVKWEPSTEKLYVRDGVLKSDGNYALSLEGGGHYRCDSKTTYKAKKVVQLPDYHAVDHHIEIKSHDKDYSNVNLHEHAEAHSGLPGQAM,padron2,,,,48700,,,Off-state,,,padron2_off-state,16.02,516,492,32700,3.5,70.0,On-state,6.6,0.49,padron2_on-state,ps,,,,,,,,DSZCH
m,10.1021/acs.nanolett.9b02855,,,pcStar,,MSAIKPDMKIKLRMEGNVNGHHFVIDGEGTGKPFEGKQSMDLEVKEGGPLPFAFDILTTAFHYGNRVFAKYPDNIQDYFKQSFPKGYSWERSMTFEDGGICNARNDITMEGDTFYNKVRFYGTNFPANGPVMQKKTLKWEPSTEKMYVRDGVLTGDIEMALLLEGGAHYRCDFRTTYKAKEKGVKLPGAHFVDHCIEILSHDKDYNKVKLYEHAVAHSGLPDNARR,pcstar,66.19,515,505,74376,,,Green,5.49,0.89,pcstar_green,21.3,579,567,48403,,,Red,6.14,0.44,pcstar_red,pc,pcstar_green,pcstar_red,405,,,,,3SXVB
m,10.1101/2021.08.02.454744,AUS83262,,phiLOV2.1,,MEKSFVITDPRLPDYPIIFASDGFLELTEYSREEIMGRNARFLQGPETDQATVQKIRDAIRDQRETTVQLINYTKSGKKFWNLLHLQPVRDRKGGLQYFIGVQLVGSDHV,philov21,2.7,501,451,13500,,,default,3.0,0.2,philov21_default,,,,,,,,,,,b,,,,,,,,T33XW
m,10.1002/pro.4261,MZ682637,,phiLOV3,,MEKSFVITDPRLPDYPIIFASDGFLELTEYSREEIMGRNARFLQGPETDQATVQKIRDAIRDRRETTVQLINYTKSGKKFWNLLHLQPVRDGKGGLQYFIGVQLVGSDHV,philov3,3.48,502,452,15800,,,default,3.3,0.22,philov3_default,,,,,,,,,,,b,,,,,,,,PG1ZQ
t,10.1007/s10126-019-09931-9,AKM77632,,plobRFP,,MALSKQTGIQTEMKTKFHMEGIVNGHSFEVEGNGSGQPYEGVQKMKLTVTKGAPLPFSIDILLPQEMYGSKPFIKYPDNIPDYIKLSFPEGITWERTMTFEDGAVCTASNDSRLVGNCFIYEVKFQGVNFPRDGPVMQRKTKGWEPSTERLYEWDGCQRGDVDMALKLEDGGHYTVNFKTTYKSKKKDLKVPPYHFVDHKLELLSHNIVGTKEDFEQKETAHAHLSSLNSLNQ,plobrfp,62.16,614,578,84000,,,default,,0.74,plobrfp_default,,,,,,,,,,,b,,,,,,,,ESQ8O
m,10.1038/s42003-019-0589-x,,,sfCherry3C,,MEEDNMAIIKEFMRFKVHMEGSVNGHEFEIEGEGEGHPYEGTQTARLKVTKGDPLPFAWDILSPQFMYGSKAYVKHPADIPDYLKLSFPEGFTWERVMNFEDGGVVAVTQDSSLQDGQFIYKVKLLGINFPSDGPVMQKKTMGWEASTERMYPEDGALKGEINQRLKLKDGGHYDAEVKTTYRAKKPVQLPGAYDVDIKLDITSHNEDYTIVEQYERAEARHST,sfcherry3c,,,,,,,,,,,,,,,,,,,,,b,,,,,,,,JT63R
,10.1021/acs.jafc.9b05473,,,SH3,,MIEKNYVITDPRLPDNPIIFASDGFLELTEYSREEILGRNARFLQGPETDQATVQKIRDAIRDQRETTVQLINYTKSGKEFWNLFHLQPVRNQKGELQYFIGVQQDGSDHV,sh3,,495,450,,,,SH3,,0.4,sh3_sh3,,,,,,,,,,,b,,,,,,,,PFYNU
m,10.1111/mmi.14206,,,Superfolder mTurquoise2,,MVSKGEELFTGVVPILVELDGDVNGHKFSVRGEGEGDATNGKLTLKFICTTGKLPVPWPTLVTTLSWGVQCFARYPDHMKQHDFFKSAMPEGYVQERTISFKDDGTYKTRAEVKFEGDTLVNRIELKGIDFKEDGNILGHKLEYNYFSDNVYITADKQKNGIKANFKIRHNVEDGGVQLADHYQQNTPIGDGPVLLPDNHYLSTQSKLSKDPNEKRDHMVLLEFVTAAGITLGMDELYK,superfolder-mturquoise2,,474,434,,,,default,,,superfolder-mturquoise2_default,,,,,,,,,,,b,,,,,,,,NFBGR
m,10.1111/mmi.14206,,,Superfolder mTurquoise2 ox,,MVSKGEELFTGVVPILVELDGDVNGHKFSVRGEGEGDATNGKLTLKFICTTGKLPVPWPTLVTTLSWGVQVFARYPDHMKQHDFFKSAMPEGYVQERTISFKDDGTYKTRAEVKFEGDTLVNRIELKGIDFKEDGNILGHKLEYNYFSDNVYITADKQKNGIKANFKIRHNVEDGGVQLADHYQQNTPIGDGPVLLPDNHYLSTQSKLSKDPNEKRDHMVLLEFVTAAGITLGMDELYK,superfolder-mturquoise2-ox,,474,434,,,,default,,,superfolder-mturquoise2-ox_default,,,,,,,,,,,b,,,,,,,,QEXW4
m,10.3390/ijms21228800,,,SuperNova2,,MGSEVGPALFQRDMTFKIFIDGEVNGQKFTIVADGSSKFPHGDFNVHAVCETGKLPMSWKPICHLIQYGEPFFARYPDGISHFAQECFPEGLSIDRTVRFENDGTMTSHHTYELDDTCVVSRITVNCDGFQPDGPIMRDQLVDILPSETHMFPHGPNAVRQTATIGFTTADGGKMMGHFDSKMTFNGSRAIEIPGPHFVTIITKQTRDTSDKRDHVCQREVAYAHSVPRITSAIGSDED,supernova2,,610,579,45,,,SuperNova2,,,supernova2_supernova2,,,,,,,,,,,b,,,,,,,,NRHQ2
m,10.1038/s41467-020-15687-x,EU582019.1,EU582019.1,super-TagRFP,,MVSKGEELIKENMHMKLYMEGTVNNHHFKCTSEGEGKPYEGTQTMRIKVVEGGPLPFAFDILATSFMYGSRTFINHTQGIPDFFKQSFPEGFTWERVTTYEDGGVLTATQDTSLQDGCLIYNVKIRGVNFPSNGPVMQKKTLGWEANTEMLYPADGGLEGRTVMALKLVGGGHLICNFKTTYRSKKPAKNLKMPGVYYVDHRLERIKEADKETYVEQHEVAVARYCDLPSKLGHKLNGMDELYK,super-tagrfp,59.89,579,555,113000,2.5,,default,,0.53,super-tagrfp_default,,,,,,,,,,,b,,,,,,,,QJV5C
m,10.1101/2021.08.02.454744,MZ682638,,TagRFP658,,MSELIKENMHMKLYMEGTVNNHHFKCTSEGEGKPYEGTQTQRIKVVEGGPLPFAFDILATSFMYGSHTFIDHTQGIPDFWKQSFPEGFTWERVTTYEDGGVLTATQDTSLHDGCLIYNVKIRGVNFPSNGPVMQKKTLGWEAHTEMLYPTDGGLEGRTALALKLVGGGHLICNFKTIYRSKKPAKNLKMPGVYYVDYRLERIEEADNETYVEQHEVAVARYCDLPTKLGHKLN,tagrfp658,4.12,658,611,41200,,,default,4.6,0.1,tagrfp658_default,,,,,,,,,,,b,,,,,,,,AJJAK
