agg,doi,genbank,ipg_id,name,pdb.0,pdb.1,pdb.2,pdb.3,seq,slug,states.0.brightness,states.0.em_max,states.0.ex_max,states.0.ext_coeff,states.0.lifetime,states.0.maturation,states.0.name,states.0.pka,states.0.qy,states.0.slug,switch_type,uniprot,uuid
m,10.1016/s0960-9822(02)00450-5,,,ECFP,5OX8,2WSN,,,MVSKGEELFTGVVPILVELDGDVNGHKFSVSGEGEGDATYGKLTLKFICTTGKLPVPWPTLVTTLTWGVQCFSRYPDHMKQHDFFKSAMPEGYVQERTIFFKDDGNYKTRAEVKFEGDTLVNRIELKGIDFKEDGNILGHKLEYNYISHNVYITADKQKNGIKANFKIRHNIEDGSVQLADHYQQNTPIGDGPVLLPDNHYLSTQSALSKDPNEKRDHMVLLEFVTAAGITLGMDELYK,ecfp,13.0,477,434,32500,3.0,,default,4.7,0.4,ecfp_default,b,,27HOS
wd,10.1016/0378-1119(95)00685-0,AAB02572,928978,EGFP,2Y0G,4EUL,,,MVSKGEELFTGVVPILVELDGDVNGHKFSVSGEGEGDATYGKLTLKFICTTGKLPVPWPTLVTTLTYGVQCFSRYPDHMKQHDFFKSAMPEGYVQERTIFFKDDGNYKTRAEVKFEGDTLVNRIELKGIDFKEDGNILGHKLEYNYNSHNVYIMADKQKNGIKVNFKIRHNIEDGSVQLADHYQQNTPIGDGPVLLPDNHYLSTQSALSKDPNEKRDHMVLLEFVTAAGITLGMDELYK,egfp,33.54,507,488,55900,2.6,25.0,default,6.0,0.6,egfp_default,b,C5MKY7,R9NL8
wd,10.1126/science.273.5280.1392,,,EYFP,,,,,MVSKGEELFTGVVPILVELDGDVNGHKFSVSGEGEGDATYGKLTLKFICTTGKLPVPWPTLVTTFGYGLQCFARYPDHMKQHDFFKSAMPEGYVQERTIFFKDDGNYKTRAEVKFEGDTLVNRIELKGIDFKEDGNILGHKLEYNYNSHNVYIMADKQKNGIKVNFKIRHNIEDGSVQLADHYQQNTPIGDGPVLLPDNHYLSYQSALSKDPNEKRDHMVLLEFVTAAGITLGMDELYK,eyfp,44.89,527,513,67000,3.1,9.0,default,6.9,0.67,eyfp_default,b,,8DNLG
m,10.1038/nmeth.1207,ABW74903,13918900,mAmetrine,,,,,MVSKGEELFTGVVPILVELDGDVNGHKFSVRGEGEGDATNGKLTLKFICTSGKLPVPWPTLVTTLSYGVQCFARYPDHMKQHDFFKSAMPEGYVQERTISFKDDGSYRTRAEVKFEGDTLVNRIELKGIDFKEDGNILGHKLEYNMNVWDAYITADKQKNGIKANFKIEHNVEDGGVQLADAYQQNTPIGDGSVLLPDNHYLSFQSKLFKDPNEQRDHMVLLEFVTAAGITPGMDELYK,mametrine,26.1,526,406,45000,,1.8,default,6.0,0.58,mametrine_default,b,,DF1S4
m,10.1016/j.chembiol.2018.08.008,MH062789,,mCarmine,,,,,MVSKGEELIKENMHMKLYMEGTVNNHHFKCTSEGEGKPYEGTQTQRIKVVEGGPLPFAFDILATSFMYGSKTFINHTQGIPDFFKQSFPEGFTWERVTTYEDGGVLKVKQDTSLQDGCLIYNVKIRGVNFPSNGPVMQKKTLGWEANTETLYPADGGLRGYNTMALKLVGGGHLQTFLKTTYRSKKPAKNLKMPGVYFVDRRLERIKEADKETYVEQHEVAVARYCDLPSKLGHKLNGMDELYK,mcarmine,5.81,675,603,83000,,,default,5.58,0.07,mcarmine_default,b,,LG377
m,10.1038/nbt1037,AAV52164,3838123,mCherry,2H5Q,,,,MVSKGEEDNMAIIKEFMRFKVHMEGSVNGHEFEIEGEGEGRPYEGTQTAKLKVTKGGPLPFAWDILSPQFMYGSKAYVKHPADIPDYLKLSFPEGFKWERVMNFEDGGVVTVTQDSSLQDGEFIYKVKLRGTNFPSDGPVMQKKTMGWEASSERMYPEDGALKGEIKQRLKLKDGGHYDAEVKTTYKAKKPVQLPGAYNVNIKLDITSHNEDYTIVEQYERAEGRHSTGGMDELYK,mcherry,15.84,610,587,72000,1.4,15.0,default,4.5,0.22,mcherry_default,b,X5DSL3,ZERB6
m,10.1038/nmeth1083,,,mKate,3BXA,3BXB,3BXC,3BX9,MSELIKENMHMKLYMEGTVNNHHFKCTSEGEGKPYEGTQTMRIKVVEGGPLPFAFDILATSFMYGSKTFINHTQGIPDFFKQSFPEGFTWERVTTYEDGGVLTATQDTSLQDGCLIYNVKIRGVNFPSNGPVMQKKTLGWEASTEMLYPADGGLEGRSDMALKLVGGGHLICNLKTTYRSKKPAKNLKMPGVYYVDRRLERIKEADKETYVEQHEVAVARYCDLPSKLGHK,mkate,14.85,635,588,45000,,,default,6.2,0.33,mkate_default,b,,WRF55
m,10.1038/nbt1037,AAV52165,3838262,mOrange,2H5O,,,,MVSKGEENNMAIIKEFMRFKVRMEGSVNGHEFEIEGEGEGRPYEGFQTAKLKVTKGGPLPFAWDILSPQFTYGSKAYVKHPADIPDYFKLSFPEGFKWERVMNFEDGGVVTVTQDSSLQDGEFIYKVKLRGTNFPSDGPVMQKKTMGWEASSERMYPEDGALKGEIKMRLKLKDGGHYTSEVKTTYKAKKPVQLPGAYIVGIKLDITSHNEDYTIVEQYERAEGRHSTGGMDELYK,morange,48.99,562,548,71000,,150.0,default,6.5,0.69,morange_default,b,,G6HDH
m,10.1073/pnas.0407752101,AAV65487,3876945,mPlum,2QLG,,,,MVSKGEEVIKEFMRFKEHMEGSVNGHEFEIEGEGEGRPYEGTQTARLKVTKGGPLPFAWDILSPQIMYGSKAYVKHPADIPDYLKLSFPEGFKWERVMNFEDGGVVTVTQDSSLQDGEFIYKVKVRGTNFPSDGPVMQKKTMGWEASSERMYPEDGALKGEMKMRLRLKDGGHYDAEVKTTYMAKKPVQLPGAYKTDIKLDITSHNEDYTIVEQYERAEGRHSTGA,mplum,4.1,649,590,41000,,100.0,default,4.5,0.1,mplum_default,b,Q5S3G7,XU2WO
m,10.1021/bi0516273,AAZ65844,4596892,mVenus,,,,,MVSKGEELFTGVVPILVELDGDVNGHKFSVSGEGEGDATYGKLTLKLICTTGKLPVPWPTLVTTLGYGLQCFARYPDHMKQHDFFKSAMPEGYVQERTIFFKDDGNYKTRAEVKFEGDTLVNRIELKGIDFKEDGNILGHKLEYNYNSHNVYITADKQKNGIKANFKIRHNIEDGGVQLADHYQQNTPIGDGPVLLPDNHYLSYQSKLSKDPNEKRDHMVLLEFVTAAGITLGMDELYK,mvenus,66.56,527,515,104000,2.7,17.6,default,5.5,0.64,mvenus_default,b,,WCSN6
